<?xml version="1.0" encoding="UTF-8"?>
  <testsuites tests="137" disabled="5" errors="0" failures="1" time="5870.142808171">
      <testsuite name="Red Hat App Studio E2E tests" package="/tmp/tmp.jToXo61xWY/repo" tests="137" disabled="0" skipped="5" errors="0" failures="1" time="5870.142808171" timestamp="2026-10-06T16:18:49">
          <properties>
              <property name="SuiteSucceeded" value="false"></property>
              <property name="SuiteHasProgrammaticFocus" value="false"></property>
              <property name="SpecialSuiteFailureReason" value=""></property>
              <property name="SuiteLabels" value="[]"></property>
              <property name="SuiteSemVerConstraints" value="[]"></property>
              <property name="SuiteComponentSemVerConstraints" value="[]"></property>
              <property name="RandomSeed" value="1791303529"></property>
              <property name="RandomizeAllSpecs" value="false"></property>
              <property name="LabelFilter" value="integration-service"></property>
              <property name="SemVerFilter" value=""></property>
              <property name="FocusStrings" value=""></property>
              <property name="SkipStrings" value=""></property>
              <property name="FocusFiles" value=""></property>
              <property name="SkipFiles" value=""></property>
              <property name="FailOnPending" value="false"></property>
              <property name="FailOnEmpty" value="false"></property>
              <property name="FailFast" value="false"></property>
              <property name="FlakeAttempts" value="0"></property>
              <property name="DryRun" value="false"></property>
              <property name="ParallelTotal" value="1"></property>
              <property name="OutputInterceptorMode" value=""></property>
          </properties>
          <testcase name="[It] [integration-service-suite Forgejo Status Reporting of Integration tests] Forgejo with status reporting of Integration tests in the associated merge request when a new Component with specified custom branch is created triggers a Build PipelineRun [integration-service, forgejo-status-reporting, custom-branch]" classname="Red Hat App Studio E2E tests" status="passed" time="38.425254122">
              <system-err>&gt; Enter [BeforeAll] Forgejo with status reporting of Integration tests in the associated merge request - /tmp/tmp.jToXo61xWY/repo/e2e-tests/tests/integration-service/forgejo-integration-reporting.go:47 @ 10/06/26 16:18:49.995&#xA;&lt; Exit [BeforeAll] Forgejo with status reporting of Integration tests in the associated merge request - /tmp/tmp.jToXo61xWY/repo/e2e-tests/tests/integration-service/forgejo-integration-reporting.go:47 @ 10/06/26 16:18:57.755 (7.76s)&#xA;&gt; Enter [BeforeAll] when a new Component with specified custom branch is created - /tmp/tmp.jToXo61xWY/repo/e2e-tests/tests/integration-service/forgejo-integration-reporting.go:111 @ 10/06/26 16:18:57.755&#xA;&lt; Exit [BeforeAll] when a new Component with specified custom branch is created - /tmp/tmp.jToXo61xWY/repo/e2e-tests/tests/integration-service/forgejo-integration-reporting.go:111 @ 10/06/26 16:19:28.412 (30.657s)&#xA;&gt; Enter [It] triggers a Build PipelineRun - /tmp/tmp.jToXo61xWY/repo/e2e-tests/tests/integration-service/forgejo-integration-reporting.go:159 @ 10/06/26 16:19:28.412&#xA;&lt; Exit [It] triggers a Build PipelineRun - /tmp/tmp.jToXo61xWY/repo/e2e-tests/tests/integration-service/forgejo-integration-reporting.go:159 @ 10/06/26 16:19:28.42 (8ms)&#xA;&gt; Enter [AfterEach] [integration-service-suite Forgejo Status Reporting of Integration tests] - /tmp/tmp.jToXo61xWY/repo/e2e-tests/tests/integration-service/forgejo-integration-reporting.go:44 @ 10/06/26 16:19:28.421&#xA;&lt; Exit [AfterEach] [integration-service-suite Forgejo Status Reporting of Integration tests] - /tmp/tmp.jToXo61xWY/repo/e2e-tests/tests/integration-service/forgejo-integration-reporting.go:44 @ 10/06/26 16:19:28.421 (0s)&#xA;</system-err>
          </testcase>
          <testcase name="[It] [integration-service-suite Forgejo Status Reporting of Integration tests] Forgejo with status reporting of Integration tests in the associated merge request when a new Component with specified custom branch is created does not contain an annotation with a Snapshot Name [integration-service, forgejo-status-reporting, custom-branch]" classname="Red Hat App Studio E2E tests" status="passed" time="0.000106382">
              <system-err>&gt; Enter [It] does not contain an annotation with a Snapshot Name - /tmp/tmp.jToXo61xWY/repo/e2e-tests/tests/integration-service/forgejo-integration-reporting.go:173 @ 10/06/26 16:19:28.421&#xA;&lt; Exit [It] does not contain an annotation with a Snapshot Name - /tmp/tmp.jToXo61xWY/repo/e2e-tests/tests/integration-service/forgejo-integration-reporting.go:173 @ 10/06/26 16:19:28.421 (0s)&#xA;&gt; Enter [AfterEach] [integration-service-suite Forgejo Status Reporting of Integration tests] - /tmp/tmp.jToXo61xWY/repo/e2e-tests/tests/integration-service/forgejo-integration-reporting.go:44 @ 10/06/26 16:19:28.421&#xA;&lt; Exit [AfterEach] [integration-service-suite Forgejo Status Reporting of Integration tests] - /tmp/tmp.jToXo61xWY/repo/e2e-tests/tests/integration-service/forgejo-integration-reporting.go:44 @ 10/06/26 16:19:28.421 (0s)&#xA;</system-err>
          </testcase>
          <testcase name="[It] [integration-service-suite Forgejo Status Reporting of Integration tests] Forgejo with status reporting of Integration tests in the associated merge request when a new Component with specified custom branch is created should lead to build PipelineRun finishing successfully [integration-service, forgejo-status-reporting, custom-branch]" classname="Red Hat App Studio E2E tests" status="passed" time="1460.016169176">
              <system-err>&gt; Enter [It] should lead to build PipelineRun finishing successfully - /tmp/tmp.jToXo61xWY/repo/e2e-tests/tests/integration-service/forgejo-integration-reporting.go:177 @ 10/06/26 16:19:28.421&#xA;PipelineRun test-comp-pac-forgejo-li4ml4-on-pull-request-kgs6h found for Component forgejo-rep-i0fd/test-comp-pac-forgejo-li4ml4&#xA;PipelineRun test-comp-pac-forgejo-li4ml4-on-pull-request-kgs6h reason: Running&#xA;PipelineRun test-comp-pac-forgejo-li4ml4-on-pull-request-kgs6h reason: Running&#xA;PipelineRun test-comp-pac-forgejo-li4ml4-on-pull-request-kgs6h reason: Running&#xA;PipelineRun test-comp-pac-forgejo-li4ml4-on-pull-request-kgs6h reason: Running&#xA;PipelineRun test-comp-pac-forgejo-li4ml4-on-pull-request-kgs6h reason: Running&#xA;PipelineRun test-comp-pac-forgejo-li4ml4-on-pull-request-kgs6h reason: Running&#xA;PipelineRun test-comp-pac-forgejo-li4ml4-on-pull-request-kgs6h reason: Running&#xA;PipelineRun test-comp-pac-forgejo-li4ml4-on-pull-request-kgs6h reason: Running&#xA;PipelineRun test-comp-pac-forgejo-li4ml4-on-pull-request-kgs6h reason: Running&#xA;PipelineRun test-comp-pac-forgejo-li4ml4-on-pull-request-kgs6h reason: Running&#xA;PipelineRun test-comp-pac-forgejo-li4ml4-on-pull-request-kgs6h reason: Running&#xA;PipelineRun test-comp-pac-forgejo-li4ml4-on-pull-request-kgs6h reason: Running&#xA;PipelineRun test-comp-pac-forgejo-li4ml4-on-pull-request-kgs6h reason: Running&#xA;PipelineRun test-comp-pac-forgejo-li4ml4-on-pull-request-kgs6h reason: Running&#xA;PipelineRun test-comp-pac-forgejo-li4ml4-on-pull-request-kgs6h reason: Running&#xA;PipelineRun test-comp-pac-forgejo-li4ml4-on-pull-request-kgs6h reason: Running&#xA;PipelineRun test-comp-pac-forgejo-li4ml4-on-pull-request-kgs6h reason: Running&#xA;PipelineRun test-comp-pac-forgejo-li4ml4-on-pull-request-kgs6h reason: Running&#xA;PipelineRun test-comp-pac-forgejo-li4ml4-on-pull-request-kgs6h reason: Running&#xA;PipelineRun test-comp-pac-forgejo-li4ml4-on-pull-request-kgs6h reason: Running&#xA;PipelineRun test-comp-pac-forgejo-li4ml4-on-pull-request-kgs6h reason: Running&#xA;PipelineRun test-comp-pac-forgejo-li4ml4-on-pull-request-kgs6h reason: Running&#xA;PipelineRun test-comp-pac-forgejo-li4ml4-on-pull-request-kgs6h reason: Running&#xA;PipelineRun test-comp-pac-forgejo-li4ml4-on-pull-request-kgs6h reason: Running&#xA;PipelineRun test-comp-pac-forgejo-li4ml4-on-pull-request-kgs6h reason: Running&#xA;PipelineRun test-comp-pac-forgejo-li4ml4-on-pull-request-kgs6h reason: Running&#xA;PipelineRun test-comp-pac-forgejo-li4ml4-on-pull-request-kgs6h reason: Running&#xA;PipelineRun test-comp-pac-forgejo-li4ml4-on-pull-request-kgs6h reason: Running&#xA;PipelineRun test-comp-pac-forgejo-li4ml4-on-pull-request-kgs6h reason: Running&#xA;PipelineRun test-comp-pac-forgejo-li4ml4-on-pull-request-kgs6h reason: Running&#xA;PipelineRun test-comp-pac-forgejo-li4ml4-on-pull-request-kgs6h reason: Running&#xA;PipelineRun test-comp-pac-forgejo-li4ml4-on-pull-request-kgs6h reason: Running&#xA;PipelineRun test-comp-pac-forgejo-li4ml4-on-pull-request-kgs6h reason: Running&#xA;PipelineRun test-comp-pac-forgejo-li4ml4-on-pull-request-kgs6h reason: Running&#xA;PipelineRun test-comp-pac-forgejo-li4ml4-on-pull-request-kgs6h reason: Running&#xA;PipelineRun test-comp-pac-forgejo-li4ml4-on-pull-request-kgs6h reason: Running&#xA;PipelineRun test-comp-pac-forgejo-li4ml4-on-pull-request-kgs6h reason: Running&#xA;PipelineRun test-comp-pac-forgejo-li4ml4-on-pull-request-kgs6h reason: Running&#xA;PipelineRun test-comp-pac-forgejo-li4ml4-on-pull-request-kgs6h reason: Running&#xA;PipelineRun test-comp-pac-forgejo-li4ml4-on-pull-request-kgs6h reason: Running&#xA;PipelineRun test-comp-pac-forgejo-li4ml4-on-pull-request-kgs6h reason: Running&#xA;PipelineRun test-comp-pac-forgejo-li4ml4-on-pull-request-kgs6h reason: Running&#xA;PipelineRun test-comp-pac-forgejo-li4ml4-on-pull-request-kgs6h reason: Running&#xA;PipelineRun test-comp-pac-forgejo-li4ml4-on-pull-request-kgs6h reason: Running&#xA;PipelineRun test-comp-pac-forgejo-li4ml4-on-pull-request-kgs6h reason: Running&#xA;PipelineRun test-comp-pac-forgejo-li4ml4-on-pull-request-kgs6h reason: Running&#xA;PipelineRun test-comp-pac-forgejo-li4ml4-on-pull-request-kgs6h reason: Running&#xA;PipelineRun test-comp-pac-forgejo-li4ml4-on-pull-request-kgs6h reason: Running&#xA;PipelineRun test-comp-pac-forgejo-li4ml4-on-pull-request-kgs6h reason: Running&#xA;PipelineRun test-comp-pac-forgejo-li4ml4-on-pull-request-kgs6h reason: Running&#xA;PipelineRun test-comp-pac-forgejo-li4ml4-on-pull-request-kgs6h reason: Running&#xA;PipelineRun test-comp-pac-forgejo-li4ml4-on-pull-request-kgs6h reason: Running&#xA;PipelineRun test-comp-pac-forgejo-li4ml4-on-pull-request-kgs6h reason: Running&#xA;PipelineRun test-comp-pac-forgejo-li4ml4-on-pull-request-kgs6h reason: Running&#xA;PipelineRun test-comp-pac-forgejo-li4ml4-on-pull-request-kgs6h reason: Running&#xA;PipelineRun test-comp-pac-forgejo-li4ml4-on-pull-request-kgs6h reason: Running&#xA;PipelineRun test-comp-pac-forgejo-li4ml4-on-pull-request-kgs6h reason: Running&#xA;PipelineRun test-comp-pac-forgejo-li4ml4-on-pull-request-kgs6h reason: Running&#xA;PipelineRun test-comp-pac-forgejo-li4ml4-on-pull-request-kgs6h reason: Running&#xA;PipelineRun test-comp-pac-forgejo-li4ml4-on-pull-request-kgs6h reason: Running&#xA;PipelineRun test-comp-pac-forgejo-li4ml4-on-pull-request-kgs6h reason: Running&#xA;PipelineRun test-comp-pac-forgejo-li4ml4-on-pull-request-kgs6h reason: Running&#xA;PipelineRun test-comp-pac-forgejo-li4ml4-on-pull-request-kgs6h reason: Running&#xA;PipelineRun test-comp-pac-forgejo-li4ml4-on-pull-request-kgs6h reason: Running&#xA;PipelineRun test-comp-pac-forgejo-li4ml4-on-pull-request-kgs6h reason: Running&#xA;PipelineRun test-comp-pac-forgejo-li4ml4-on-pull-request-kgs6h reason: Running&#xA;PipelineRun test-comp-pac-forgejo-li4ml4-on-pull-request-kgs6h reason: Running&#xA;PipelineRun test-comp-pac-forgejo-li4ml4-on-pull-request-kgs6h reason: Running&#xA;PipelineRun test-comp-pac-forgejo-li4ml4-on-pull-request-kgs6h reason: Running&#xA;PipelineRun integration-test-5ale-5qktv reason: ResolvingTaskRef&#xA;PipelineRun integration-test-5ale-5qktv reason: Running&#xA;PipelineRun integration-test-5ale-5qktv reason: Running&#xA;PipelineRun integration-test-5ale-5qktv reason: Running&#xA;PipelineRun integration-test-5ale-5qktv reason: Succeeded&#xA;&lt; Exit [It] should lead to build PipelineRun finishing successfully - /tmp/tmp.jToXo61xWY/repo/e2e-tests/tests/integration-service/forgejo-integration-reporting.go:177 @ 10/06/26 16:43:48.437 (24m20.016s)&#xA;&gt; Enter [AfterEach] [integration-service-suite Forgejo Status Reporting of Integration tests] - /tmp/tmp.jToXo61xWY/repo/e2e-tests/tests/integration-service/forgejo-integration-reporting.go:44 @ 10/06/26 16:43:48.437&#xA;&lt; Exit [AfterEach] [integration-service-suite Forgejo Status Reporting of Integration tests] - /tmp/tmp.jToXo61xWY/repo/e2e-tests/tests/integration-service/forgejo-integration-reporting.go:44 @ 10/06/26 16:43:48.437 (0s)&#xA;</system-err>
          </testcase>
          <testcase name="[It] [integration-service-suite Forgejo Status Reporting of Integration tests] Forgejo with status reporting of Integration tests in the associated merge request when a new Component with specified custom branch is created should have a related PaC init MR created [integration-service, forgejo-status-reporting, custom-branch]" classname="Red Hat App Studio E2E tests" status="passed" time="0.003938607">
              <system-err>&gt; Enter [It] should have a related PaC init MR created - /tmp/tmp.jToXo61xWY/repo/e2e-tests/tests/integration-service/forgejo-integration-reporting.go:182 @ 10/06/26 16:43:48.437&#xA;&lt; Exit [It] should have a related PaC init MR created - /tmp/tmp.jToXo61xWY/repo/e2e-tests/tests/integration-service/forgejo-integration-reporting.go:182 @ 10/06/26 16:43:48.441 (4ms)&#xA;&gt; Enter [AfterEach] [integration-service-suite Forgejo Status Reporting of Integration tests] - /tmp/tmp.jToXo61xWY/repo/e2e-tests/tests/integration-service/forgejo-integration-reporting.go:44 @ 10/06/26 16:43:48.441&#xA;&lt; Exit [AfterEach] [integration-service-suite Forgejo Status Reporting of Integration tests] - /tmp/tmp.jToXo61xWY/repo/e2e-tests/tests/integration-service/forgejo-integration-reporting.go:44 @ 10/06/26 16:43:48.441 (0s)&#xA;</system-err>
          </testcase>
          <testcase name="[It] [integration-service-suite Forgejo Status Reporting of Integration tests] Forgejo with status reporting of Integration tests in the associated merge request when a new Component with specified custom branch is created the PipelineRun should eventually finish successfully for component  [integration-service, forgejo-status-reporting, custom-branch]" classname="Red Hat App Studio E2E tests" status="passed" time="0.004060599">
              <system-err>&gt; Enter [It] the PipelineRun should eventually finish successfully for component  - /tmp/tmp.jToXo61xWY/repo/e2e-tests/tests/integration-service/forgejo-integration-reporting.go:191 @ 10/06/26 16:43:48.441&#xA;PipelineRun integration-test-5ale-5qktv found for Component forgejo-rep-i0fd/test-comp-pac-forgejo-li4ml4&#xA;PipelineRun integration-test-5ale-5qktv reason: Succeeded&#xA;&lt; Exit [It] the PipelineRun should eventually finish successfully for component  - /tmp/tmp.jToXo61xWY/repo/e2e-tests/tests/integration-service/forgejo-integration-reporting.go:191 @ 10/06/26 16:43:48.445 (4ms)&#xA;&gt; Enter [AfterEach] [integration-service-suite Forgejo Status Reporting of Integration tests] - /tmp/tmp.jToXo61xWY/repo/e2e-tests/tests/integration-service/forgejo-integration-reporting.go:44 @ 10/06/26 16:43:48.445&#xA;&lt; Exit [AfterEach] [integration-service-suite Forgejo Status Reporting of Integration tests] - /tmp/tmp.jToXo61xWY/repo/e2e-tests/tests/integration-service/forgejo-integration-reporting.go:44 @ 10/06/26 16:43:48.445 (0s)&#xA;</system-err>
          </testcase>
          <testcase name="[It] [integration-service-suite Forgejo Status Reporting of Integration tests] Forgejo with status reporting of Integration tests in the associated merge request when the PaC build pipelineRun run succeeded checks if the BuildPipelineRun has the annotation of chains signed [integration-service, forgejo-status-reporting]" classname="Red Hat App Studio E2E tests" status="passed" time="0.00727371">
              <system-err>&gt; Enter [It] checks if the BuildPipelineRun has the annotation of chains signed - /tmp/tmp.jToXo61xWY/repo/e2e-tests/tests/integration-service/forgejo-integration-reporting.go:198 @ 10/06/26 16:43:48.445&#xA;&lt; Exit [It] checks if the BuildPipelineRun has the annotation of chains signed - /tmp/tmp.jToXo61xWY/repo/e2e-tests/tests/integration-service/forgejo-integration-reporting.go:198 @ 10/06/26 16:43:48.452 (7ms)&#xA;&gt; Enter [AfterEach] [integration-service-suite Forgejo Status Reporting of Integration tests] - /tmp/tmp.jToXo61xWY/repo/e2e-tests/tests/integration-service/forgejo-integration-reporting.go:44 @ 10/06/26 16:43:48.452&#xA;&lt; Exit [AfterEach] [integration-service-suite Forgejo Status Reporting of Integration tests] - /tmp/tmp.jToXo61xWY/repo/e2e-tests/tests/integration-service/forgejo-integration-reporting.go:44 @ 10/06/26 16:43:48.452 (0s)&#xA;</system-err>
          </testcase>
          <testcase name="[It] [integration-service-suite Forgejo Status Reporting of Integration tests] Forgejo with status reporting of Integration tests in the associated merge request when the PaC build pipelineRun run succeeded checks if the Snapshot is created [integration-service, forgejo-status-reporting]" classname="Red Hat App Studio E2E tests" status="passed" time="0.002770541">
              <system-err>&gt; Enter [It] checks if the Snapshot is created - /tmp/tmp.jToXo61xWY/repo/e2e-tests/tests/integration-service/forgejo-integration-reporting.go:202 @ 10/06/26 16:43:48.453&#xA;&lt; Exit [It] checks if the Snapshot is created - /tmp/tmp.jToXo61xWY/repo/e2e-tests/tests/integration-service/forgejo-integration-reporting.go:202 @ 10/06/26 16:43:48.455 (3ms)&#xA;&gt; Enter [AfterEach] [integration-service-suite Forgejo Status Reporting of Integration tests] - /tmp/tmp.jToXo61xWY/repo/e2e-tests/tests/integration-service/forgejo-integration-reporting.go:44 @ 10/06/26 16:43:48.455&#xA;&lt; Exit [AfterEach] [integration-service-suite Forgejo Status Reporting of Integration tests] - /tmp/tmp.jToXo61xWY/repo/e2e-tests/tests/integration-service/forgejo-integration-reporting.go:44 @ 10/06/26 16:43:48.455 (0s)&#xA;</system-err>
          </testcase>
          <testcase name="[It] [integration-service-suite Forgejo Status Reporting of Integration tests] Forgejo with status reporting of Integration tests in the associated merge request when the PaC build pipelineRun run succeeded checks if the Build PipelineRun got annotated with Snapshot name [integration-service, forgejo-status-reporting]" classname="Red Hat App Studio E2E tests" status="passed" time="0.007417774">
              <system-err>&gt; Enter [It] checks if the Build PipelineRun got annotated with Snapshot name - /tmp/tmp.jToXo61xWY/repo/e2e-tests/tests/integration-service/forgejo-integration-reporting.go:207 @ 10/06/26 16:43:48.455&#xA;&lt; Exit [It] checks if the Build PipelineRun got annotated with Snapshot name - /tmp/tmp.jToXo61xWY/repo/e2e-tests/tests/integration-service/forgejo-integration-reporting.go:207 @ 10/06/26 16:43:48.463 (7ms)&#xA;&gt; Enter [AfterEach] [integration-service-suite Forgejo Status Reporting of Integration tests] - /tmp/tmp.jToXo61xWY/repo/e2e-tests/tests/integration-service/forgejo-integration-reporting.go:44 @ 10/06/26 16:43:48.463&#xA;&lt; Exit [AfterEach] [integration-service-suite Forgejo Status Reporting of Integration tests] - /tmp/tmp.jToXo61xWY/repo/e2e-tests/tests/integration-service/forgejo-integration-reporting.go:44 @ 10/06/26 16:43:48.463 (0s)&#xA;</system-err>
          </testcase>
          <testcase name="[It] [integration-service-suite Forgejo Status Reporting of Integration tests] Forgejo with status reporting of Integration tests in the associated merge request when the Snapshot was created should find the Integration Test Scenario PipelineRun [integration-service, forgejo-status-reporting]" classname="Red Hat App Studio E2E tests" status="passed" time="0.002431583">
              <system-err>&gt; Enter [It] should find the Integration Test Scenario PipelineRun - /tmp/tmp.jToXo61xWY/repo/e2e-tests/tests/integration-service/forgejo-integration-reporting.go:213 @ 10/06/26 16:43:48.463&#xA;&lt; Exit [It] should find the Integration Test Scenario PipelineRun - /tmp/tmp.jToXo61xWY/repo/e2e-tests/tests/integration-service/forgejo-integration-reporting.go:213 @ 10/06/26 16:43:48.465 (2ms)&#xA;&gt; Enter [AfterEach] [integration-service-suite Forgejo Status Reporting of Integration tests] - /tmp/tmp.jToXo61xWY/repo/e2e-tests/tests/integration-service/forgejo-integration-reporting.go:44 @ 10/06/26 16:43:48.465&#xA;&lt; Exit [AfterEach] [integration-service-suite Forgejo Status Reporting of Integration tests] - /tmp/tmp.jToXo61xWY/repo/e2e-tests/tests/integration-service/forgejo-integration-reporting.go:44 @ 10/06/26 16:43:48.465 (0s)&#xA;</system-err>
          </testcase>
          <testcase name="[It] [integration-service-suite Forgejo Status Reporting of Integration tests] Forgejo with status reporting of Integration tests in the associated merge request when Integration PipelineRun is created should eventually complete successfully [integration-service, forgejo-status-reporting]" classname="Red Hat App Studio E2E tests" status="passed" time="0.002513095">
              <system-err>&gt; Enter [It] should eventually complete successfully - /tmp/tmp.jToXo61xWY/repo/e2e-tests/tests/integration-service/forgejo-integration-reporting.go:222 @ 10/06/26 16:43:48.465&#xA;PipelineRun integration-test-5ale-5qktv reason: Succeeded&#xA;&lt; Exit [It] should eventually complete successfully - /tmp/tmp.jToXo61xWY/repo/e2e-tests/tests/integration-service/forgejo-integration-reporting.go:222 @ 10/06/26 16:43:48.468 (2ms)&#xA;&gt; Enter [AfterEach] [integration-service-suite Forgejo Status Reporting of Integration tests] - /tmp/tmp.jToXo61xWY/repo/e2e-tests/tests/integration-service/forgejo-integration-reporting.go:44 @ 10/06/26 16:43:48.468&#xA;&lt; Exit [AfterEach] [integration-service-suite Forgejo Status Reporting of Integration tests] - /tmp/tmp.jToXo61xWY/repo/e2e-tests/tests/integration-service/forgejo-integration-reporting.go:44 @ 10/06/26 16:43:48.468 (0s)&#xA;</system-err>
          </testcase>
          <testcase name="[It] [integration-service-suite Forgejo Status Reporting of Integration tests] Forgejo with status reporting of Integration tests in the associated merge request when Integration PipelineRun is created eventually leads to the integration test PipelineRun&#39;s Pass status reported at MR commit status [integration-service, forgejo-status-reporting]" classname="Red Hat App Studio E2E tests" status="failed" time="600.028181751">
              <failure message="Timed out after 600.001s.&#xA;timed out waiting for the PaC commit status to appear for 89d693b9385d633496525cd1610c7d01f63a1f89&#xA;Expected&#xA;    &lt;bool&gt;: false&#xA;to be true" type="failed">[FAILED] Timed out after 600.001s.&#xA;timed out waiting for the PaC commit status to appear for 89d693b9385d633496525cd1610c7d01f63a1f89&#xA;Expected&#xA;    &lt;bool&gt;: false&#xA;to be true&#xA;In [It] at: /tmp/tmp.jToXo61xWY/repo/e2e-tests/pkg/clients/forgejo/git.go:342 @ 10/06/26 16:53:48.469&#xA;</failure>
              <system-err>&gt; Enter [It] eventually leads to the integration test PipelineRun&#39;s Pass status reported at MR commit status - /tmp/tmp.jToXo61xWY/repo/e2e-tests/tests/integration-service/forgejo-integration-reporting.go:227 @ 10/06/26 16:43:48.468&#xA;[FAILED] Timed out after 600.001s.&#xA;timed out waiting for the PaC commit status to appear for 89d693b9385d633496525cd1610c7d01f63a1f89&#xA;Expected&#xA;    &lt;bool&gt;: false&#xA;to be true&#xA;In [It] at: /tmp/tmp.jToXo61xWY/repo/e2e-tests/pkg/clients/forgejo/git.go:342 @ 10/06/26 16:53:48.469&#xA;&lt; Exit [It] eventually leads to the integration test PipelineRun&#39;s Pass status reported at MR commit status - /tmp/tmp.jToXo61xWY/repo/e2e-tests/tests/integration-service/forgejo-integration-reporting.go:227 @ 10/06/26 16:53:48.469 (10m0.001s)&#xA;&gt; Enter [AfterAll] Forgejo with status reporting of Integration tests in the associated merge request - /tmp/tmp.jToXo61xWY/repo/e2e-tests/tests/integration-service/forgejo-integration-reporting.go:95 @ 10/06/26 16:53:48.469&#xA;&lt; Exit [AfterAll] Forgejo with status reporting of Integration tests in the associated merge request - /tmp/tmp.jToXo61xWY/repo/e2e-tests/tests/integration-service/forgejo-integration-reporting.go:95 @ 10/06/26 16:53:48.469 (0s)&#xA;&gt; Enter [AfterEach] [integration-service-suite Forgejo Status Reporting of Integration tests] - /tmp/tmp.jToXo61xWY/repo/e2e-tests/tests/integration-service/forgejo-integration-reporting.go:44 @ 10/06/26 16:53:48.469&#xA;&lt; Exit [AfterEach] [integration-service-suite Forgejo Status Reporting of Integration tests] - /tmp/tmp.jToXo61xWY/repo/e2e-tests/tests/integration-service/forgejo-integration-reporting.go:44 @ 10/06/26 16:53:48.496 (27ms)&#xA;</system-err>
          </testcase>
          <testcase name="[It] [integration-service-suite Forgejo Status Reporting of Integration tests] Forgejo with status reporting of Integration tests in the associated merge request when Integration PipelineRun is created validates at least one MR comment contains the final integration test result [integration-service, forgejo-status-reporting]" classname="Red Hat App Studio E2E tests" status="skipped" time="0">
              <skipped message="skipped - Spec skipped because an earlier spec in an ordered container failed"></skipped>
              <system-err>[SKIPPED] Spec skipped because an earlier spec in an ordered container failed&#xA;In [It] at: /tmp/tmp.jToXo61xWY/repo/e2e-tests/tests/integration-service/forgejo-integration-reporting.go:233 @ 10/06/26 16:53:48.496&#xA;</system-err>
          </testcase>
          <testcase name="[It] [integration-service-suite Forgejo Status Reporting of Integration tests] Forgejo with status reporting of Integration tests in the associated merge request when Integration PipelineRun is created merging the PR should be successful [integration-service, forgejo-status-reporting]" classname="Red Hat App Studio E2E tests" status="skipped" time="0">
              <skipped message="skipped - Spec skipped because an earlier spec in an ordered container failed"></skipped>
              <system-err>[SKIPPED] Spec skipped because an earlier spec in an ordered container failed&#xA;In [It] at: /tmp/tmp.jToXo61xWY/repo/e2e-tests/tests/integration-service/forgejo-integration-reporting.go:262 @ 10/06/26 16:53:48.496&#xA;</system-err>
          </testcase>
          <testcase name="[It] [integration-service-suite Forgejo Status Reporting of Integration tests] Forgejo with status reporting of Integration tests in the associated merge request when Integration PipelineRun is created leads to triggering a push PipelineRun [integration-service, forgejo-status-reporting]" classname="Red Hat App Studio E2E tests" status="skipped" time="0">
              <skipped message="skipped - Spec skipped because an earlier spec in an ordered container failed"></skipped>
              <system-err>[SKIPPED] Spec skipped because an earlier spec in an ordered container failed&#xA;In [It] at: /tmp/tmp.jToXo61xWY/repo/e2e-tests/tests/integration-service/forgejo-integration-reporting.go:277 @ 10/06/26 16:53:48.496&#xA;</system-err>
          </testcase>
          <testcase name="[It] [integration-service-suite Forgejo Status Reporting of Integration tests] Forgejo with status reporting of Integration tests in the associated merge request when Run integration tests after Merged MR should eventually complete successfully [integration-service, forgejo-status-reporting]" classname="Red Hat App Studio E2E tests" status="skipped" time="0">
              <skipped message="skipped - Spec skipped because an earlier spec in an ordered container failed"></skipped>
              <system-err>[SKIPPED] Spec skipped because an earlier spec in an ordered container failed&#xA;In [It] at: /tmp/tmp.jToXo61xWY/repo/e2e-tests/tests/integration-service/forgejo-integration-reporting.go:294 @ 10/06/26 16:53:48.496&#xA;</system-err>
          </testcase>
          <testcase name="[It] [integration-service-suite Forgejo Status Reporting of Integration tests] Forgejo with status reporting of Integration tests in the associated merge request when Run integration tests after Merged MR eventually leads to the integration test PipelineRun&#39;s Pass status reported at MR commit status [integration-service, forgejo-status-reporting]" classname="Red Hat App Studio E2E tests" status="skipped" time="0">
              <skipped message="skipped - Spec skipped because an earlier spec in an ordered container failed"></skipped>
              <system-err>[SKIPPED] Spec skipped because an earlier spec in an ordered container failed&#xA;In [It] at: /tmp/tmp.jToXo61xWY/repo/e2e-tests/tests/integration-service/forgejo-integration-reporting.go:299 @ 10/06/26 16:53:48.496&#xA;</system-err>
          </testcase>
          <testcase name="[It] [integration-service-suite Gitlab Status Reporting of Integration tests] Gitlab with status reporting of Integration tests in the assosiated merge request when a new Component with specified custom branch is created triggers a Build PipelineRun [integration-service, gitlab-status-reporting, custom-branch]" classname="Red Hat App Studio E2E tests" status="passed" time="32.05958075">
              <system-err>&gt; Enter [BeforeAll] Gitlab with status reporting of Integration tests in the assosiated merge request - /tmp/tmp.jToXo61xWY/repo/e2e-tests/tests/integration-service/gitlab-integration-reporting.go:44 @ 10/06/26 16:53:48.496&#xA;&lt; Exit [BeforeAll] Gitlab with status reporting of Integration tests in the assosiated merge request - /tmp/tmp.jToXo61xWY/repo/e2e-tests/tests/integration-service/gitlab-integration-reporting.go:44 @ 10/06/26 16:53:50.531 (2.035s)&#xA;&gt; Enter [BeforeAll] when a new Component with specified custom branch is created - /tmp/tmp.jToXo61xWY/repo/e2e-tests/tests/integration-service/gitlab-integration-reporting.go:120 @ 10/06/26 16:53:50.531&#xA;&lt; Exit [BeforeAll] when a new Component with specified custom branch is created - /tmp/tmp.jToXo61xWY/repo/e2e-tests/tests/integration-service/gitlab-integration-reporting.go:120 @ 10/06/26 16:54:00.545 (10.013s)&#xA;&gt; Enter [It] triggers a Build PipelineRun - /tmp/tmp.jToXo61xWY/repo/e2e-tests/tests/integration-service/gitlab-integration-reporting.go:141 @ 10/06/26 16:54:00.545&#xA;Build PipelineRun has not been created yet for the component gitlab-rep-pjao/test-comp-pac-gitlab-a5h4od&#xA;&lt; Exit [It] triggers a Build PipelineRun - /tmp/tmp.jToXo61xWY/repo/e2e-tests/tests/integration-service/gitlab-integration-reporting.go:141 @ 10/06/26 16:54:20.556 (20.011s)&#xA;&gt; Enter [AfterEach] [integration-service-suite Gitlab Status Reporting of Integration tests] - /tmp/tmp.jToXo61xWY/repo/e2e-tests/tests/integration-service/gitlab-integration-reporting.go:41 @ 10/06/26 16:54:20.556&#xA;&lt; Exit [AfterEach] [integration-service-suite Gitlab Status Reporting of Integration tests] - /tmp/tmp.jToXo61xWY/repo/e2e-tests/tests/integration-service/gitlab-integration-reporting.go:41 @ 10/06/26 16:54:20.556 (0s)&#xA;</system-err>
          </testcase>
          <testcase name="[It] [integration-service-suite Gitlab Status Reporting of Integration tests] Gitlab with status reporting of Integration tests in the assosiated merge request when a new Component with specified custom branch is created does not contain an annotation with a Snapshot Name [integration-service, gitlab-status-reporting, custom-branch]" classname="Red Hat App Studio E2E tests" status="passed" time="6.8581e-05">
              <system-err>&gt; Enter [It] does not contain an annotation with a Snapshot Name - /tmp/tmp.jToXo61xWY/repo/e2e-tests/tests/integration-service/gitlab-integration-reporting.go:155 @ 10/06/26 16:54:20.556&#xA;&lt; Exit [It] does not contain an annotation with a Snapshot Name - /tmp/tmp.jToXo61xWY/repo/e2e-tests/tests/integration-service/gitlab-integration-reporting.go:155 @ 10/06/26 16:54:20.556 (0s)&#xA;&gt; Enter [AfterEach] [integration-service-suite Gitlab Status Reporting of Integration tests] - /tmp/tmp.jToXo61xWY/repo/e2e-tests/tests/integration-service/gitlab-integration-reporting.go:41 @ 10/06/26 16:54:20.556&#xA;&lt; Exit [AfterEach] [integration-service-suite Gitlab Status Reporting of Integration tests] - /tmp/tmp.jToXo61xWY/repo/e2e-tests/tests/integration-service/gitlab-integration-reporting.go:41 @ 10/06/26 16:54:20.556 (0s)&#xA;</system-err>
          </testcase>
          <testcase name="[It] [integration-service-suite Gitlab Status Reporting of Integration tests] Gitlab with status reporting of Integration tests in the assosiated merge request when a new Component with specified custom branch is created should lead to build PipelineRun finishing successfully [integration-service, gitlab-status-reporting, custom-branch]" classname="Red Hat App Studio E2E tests" status="passed" time="360.009835153">
              <system-err>&gt; Enter [It] should lead to build PipelineRun finishing successfully - /tmp/tmp.jToXo61xWY/repo/e2e-tests/tests/integration-service/gitlab-integration-reporting.go:159 @ 10/06/26 16:54:20.556&#xA;PipelineRun test-comp-pac-gitlab-a5h4od-on-pull-request-9ksn2 found for Component gitlab-rep-pjao/test-comp-pac-gitlab-a5h4od&#xA;PipelineRun test-comp-pac-gitlab-a5h4od-on-pull-request-9ksn2 reason: Running&#xA;PipelineRun test-comp-pac-gitlab-a5h4od-on-pull-request-9ksn2 reason: Running&#xA;PipelineRun test-comp-pac-gitlab-a5h4od-on-pull-request-9ksn2 reason: Running&#xA;PipelineRun test-comp-pac-gitlab-a5h4od-on-pull-request-9ksn2 reason: Running&#xA;PipelineRun test-comp-pac-gitlab-a5h4od-on-pull-request-9ksn2 reason: Running&#xA;PipelineRun test-comp-pac-gitlab-a5h4od-on-pull-request-9ksn2 reason: Running&#xA;PipelineRun test-comp-pac-gitlab-a5h4od-on-pull-request-9ksn2 reason: Running&#xA;PipelineRun test-comp-pac-gitlab-a5h4od-on-pull-request-9ksn2 reason: Running&#xA;PipelineRun test-comp-pac-gitlab-a5h4od-on-pull-request-9ksn2 reason: Running&#xA;PipelineRun test-comp-pac-gitlab-a5h4od-on-pull-request-9ksn2 reason: Running&#xA;PipelineRun test-comp-pac-gitlab-a5h4od-on-pull-request-9ksn2 reason: Running&#xA;PipelineRun test-comp-pac-gitlab-a5h4od-on-pull-request-9ksn2 reason: Running&#xA;PipelineRun test-comp-pac-gitlab-a5h4od-on-pull-request-9ksn2 reason: Running&#xA;PipelineRun test-comp-pac-gitlab-a5h4od-on-pull-request-9ksn2 reason: Running&#xA;PipelineRun test-comp-pac-gitlab-a5h4od-on-pull-request-9ksn2 reason: Running&#xA;PipelineRun test-comp-pac-gitlab-a5h4od-on-pull-request-9ksn2 reason: Running&#xA;PipelineRun test-comp-pac-gitlab-a5h4od-on-pull-request-9ksn2 reason: Running&#xA;PipelineRun test-comp-pac-gitlab-a5h4od-on-pull-request-9ksn2 reason: Running&#xA;PipelineRun integration-test-3ykr-c82cw reason: Succeeded&#xA;&lt; Exit [It] should lead to build PipelineRun finishing successfully - /tmp/tmp.jToXo61xWY/repo/e2e-tests/tests/integration-service/gitlab-integration-reporting.go:159 @ 10/06/26 17:00:20.566 (6m0.01s)&#xA;&gt; Enter [AfterEach] [integration-service-suite Gitlab Status Reporting of Integration tests] - /tmp/tmp.jToXo61xWY/repo/e2e-tests/tests/integration-service/gitlab-integration-reporting.go:41 @ 10/06/26 17:00:20.566&#xA;&lt; Exit [AfterEach] [integration-service-suite Gitlab Status Reporting of Integration tests] - /tmp/tmp.jToXo61xWY/repo/e2e-tests/tests/integration-service/gitlab-integration-reporting.go:41 @ 10/06/26 17:00:20.566 (0s)&#xA;</system-err>
          </testcase>
          <testcase name="[It] [integration-service-suite Gitlab Status Reporting of Integration tests] Gitlab with status reporting of Integration tests in the assosiated merge request when a new Component with specified custom branch is created should have a related PaC init MR is created [integration-service, gitlab-status-reporting, custom-branch]" classname="Red Hat App Studio E2E tests" status="passed" time="0.548991071">
              <system-err>&gt; Enter [It] should have a related PaC init MR is created - /tmp/tmp.jToXo61xWY/repo/e2e-tests/tests/integration-service/gitlab-integration-reporting.go:164 @ 10/06/26 17:00:20.566&#xA;&lt; Exit [It] should have a related PaC init MR is created - /tmp/tmp.jToXo61xWY/repo/e2e-tests/tests/integration-service/gitlab-integration-reporting.go:164 @ 10/06/26 17:00:21.115 (549ms)&#xA;&gt; Enter [AfterEach] [integration-service-suite Gitlab Status Reporting of Integration tests] - /tmp/tmp.jToXo61xWY/repo/e2e-tests/tests/integration-service/gitlab-integration-reporting.go:41 @ 10/06/26 17:00:21.115&#xA;&lt; Exit [AfterEach] [integration-service-suite Gitlab Status Reporting of Integration tests] - /tmp/tmp.jToXo61xWY/repo/e2e-tests/tests/integration-service/gitlab-integration-reporting.go:41 @ 10/06/26 17:00:21.115 (0s)&#xA;</system-err>
          </testcase>
          <testcase name="[It] [integration-service-suite Gitlab Status Reporting of Integration tests] Gitlab with status reporting of Integration tests in the assosiated merge request when a new Component with specified custom branch is created the PipelineRun should eventually finish successfully for component  [integration-service, gitlab-status-reporting, custom-branch]" classname="Red Hat App Studio E2E tests" status="passed" time="0.00623131">
              <system-err>&gt; Enter [It] the PipelineRun should eventually finish successfully for component  - /tmp/tmp.jToXo61xWY/repo/e2e-tests/tests/integration-service/gitlab-integration-reporting.go:183 @ 10/06/26 17:00:21.115&#xA;PipelineRun integration-test-3ykr-c82cw found for Component gitlab-rep-pjao/test-comp-pac-gitlab-a5h4od&#xA;PipelineRun integration-test-3ykr-c82cw reason: Succeeded&#xA;&lt; Exit [It] the PipelineRun should eventually finish successfully for component  - /tmp/tmp.jToXo61xWY/repo/e2e-tests/tests/integration-service/gitlab-integration-reporting.go:183 @ 10/06/26 17:00:21.121 (6ms)&#xA;&gt; Enter [AfterEach] [integration-service-suite Gitlab Status Reporting of Integration tests] - /tmp/tmp.jToXo61xWY/repo/e2e-tests/tests/integration-service/gitlab-integration-reporting.go:41 @ 10/06/26 17:00:21.121&#xA;&lt; Exit [AfterEach] [integration-service-suite Gitlab Status Reporting of Integration tests] - /tmp/tmp.jToXo61xWY/repo/e2e-tests/tests/integration-service/gitlab-integration-reporting.go:41 @ 10/06/26 17:00:21.121 (0s)&#xA;</system-err>
          </testcase>
          <testcase name="[It] [integration-service-suite Gitlab Status Reporting of Integration tests] Gitlab with status reporting of Integration tests in the assosiated merge request when the PaC build pipelineRun run succeeded checks if the BuildPipelineRun have the annotation of chains signed [integration-service, gitlab-status-reporting]" classname="Red Hat App Studio E2E tests" status="passed" time="0.007820965">
              <system-err>&gt; Enter [It] checks if the BuildPipelineRun have the annotation of chains signed - /tmp/tmp.jToXo61xWY/repo/e2e-tests/tests/integration-service/gitlab-integration-reporting.go:190 @ 10/06/26 17:00:21.121&#xA;&lt; Exit [It] checks if the BuildPipelineRun have the annotation of chains signed - /tmp/tmp.jToXo61xWY/repo/e2e-tests/tests/integration-service/gitlab-integration-reporting.go:190 @ 10/06/26 17:00:21.129 (8ms)&#xA;&gt; Enter [AfterEach] [integration-service-suite Gitlab Status Reporting of Integration tests] - /tmp/tmp.jToXo61xWY/repo/e2e-tests/tests/integration-service/gitlab-integration-reporting.go:41 @ 10/06/26 17:00:21.129&#xA;&lt; Exit [AfterEach] [integration-service-suite Gitlab Status Reporting of Integration tests] - /tmp/tmp.jToXo61xWY/repo/e2e-tests/tests/integration-service/gitlab-integration-reporting.go:41 @ 10/06/26 17:00:21.129 (0s)&#xA;</system-err>
          </testcase>
          <testcase name="[It] [integration-service-suite Gitlab Status Reporting of Integration tests] Gitlab with status reporting of Integration tests in the assosiated merge request when the PaC build pipelineRun run succeeded checks if the Snapshot is created [integration-service, gitlab-status-reporting]" classname="Red Hat App Studio E2E tests" status="passed" time="0.002950906">
              <system-err>&gt; Enter [It] checks if the Snapshot is created - /tmp/tmp.jToXo61xWY/repo/e2e-tests/tests/integration-service/gitlab-integration-reporting.go:194 @ 10/06/26 17:00:21.129&#xA;&lt; Exit [It] checks if the Snapshot is created - /tmp/tmp.jToXo61xWY/repo/e2e-tests/tests/integration-service/gitlab-integration-reporting.go:194 @ 10/06/26 17:00:21.132 (3ms)&#xA;&gt; Enter [AfterEach] [integration-service-suite Gitlab Status Reporting of Integration tests] - /tmp/tmp.jToXo61xWY/repo/e2e-tests/tests/integration-service/gitlab-integration-reporting.go:41 @ 10/06/26 17:00:21.132&#xA;&lt; Exit [AfterEach] [integration-service-suite Gitlab Status Reporting of Integration tests] - /tmp/tmp.jToXo61xWY/repo/e2e-tests/tests/integration-service/gitlab-integration-reporting.go:41 @ 10/06/26 17:00:21.132 (0s)&#xA;</system-err>
          </testcase>
          <testcase name="[It] [integration-service-suite Gitlab Status Reporting of Integration tests] Gitlab with status reporting of Integration tests in the assosiated merge request when the PaC build pipelineRun run succeeded checks if the Build PipelineRun got annotated with Snapshot name [integration-service, gitlab-status-reporting]" classname="Red Hat App Studio E2E tests" status="passed" time="0.007656562">
              <system-err>&gt; Enter [It] checks if the Build PipelineRun got annotated with Snapshot name - /tmp/tmp.jToXo61xWY/repo/e2e-tests/tests/integration-service/gitlab-integration-reporting.go:199 @ 10/06/26 17:00:21.132&#xA;&lt; Exit [It] checks if the Build PipelineRun got annotated with Snapshot name - /tmp/tmp.jToXo61xWY/repo/e2e-tests/tests/integration-service/gitlab-integration-reporting.go:199 @ 10/06/26 17:00:21.14 (8ms)&#xA;&gt; Enter [AfterEach] [integration-service-suite Gitlab Status Reporting of Integration tests] - /tmp/tmp.jToXo61xWY/repo/e2e-tests/tests/integration-service/gitlab-integration-reporting.go:41 @ 10/06/26 17:00:21.14&#xA;&lt; Exit [AfterEach] [integration-service-suite Gitlab Status Reporting of Integration tests] - /tmp/tmp.jToXo61xWY/repo/e2e-tests/tests/integration-service/gitlab-integration-reporting.go:41 @ 10/06/26 17:00:21.14 (0s)&#xA;</system-err>
          </testcase>
          <testcase name="[It] [integration-service-suite Gitlab Status Reporting of Integration tests] Gitlab with status reporting of Integration tests in the assosiated merge request when the Snapshot was created should find the Integration Test Scenario PipelineRun [integration-service, gitlab-status-reporting]" classname="Red Hat App Studio E2E tests" status="passed" time="0.002417384">
              <system-err>&gt; Enter [It] should find the Integration Test Scenario PipelineRun - /tmp/tmp.jToXo61xWY/repo/e2e-tests/tests/integration-service/gitlab-integration-reporting.go:205 @ 10/06/26 17:00:21.14&#xA;&lt; Exit [It] should find the Integration Test Scenario PipelineRun - /tmp/tmp.jToXo61xWY/repo/e2e-tests/tests/integration-service/gitlab-integration-reporting.go:205 @ 10/06/26 17:00:21.142 (2ms)&#xA;&gt; Enter [AfterEach] [integration-service-suite Gitlab Status Reporting of Integration tests] - /tmp/tmp.jToXo61xWY/repo/e2e-tests/tests/integration-service/gitlab-integration-reporting.go:41 @ 10/06/26 17:00:21.142&#xA;&lt; Exit [AfterEach] [integration-service-suite Gitlab Status Reporting of Integration tests] - /tmp/tmp.jToXo61xWY/repo/e2e-tests/tests/integration-service/gitlab-integration-reporting.go:41 @ 10/06/26 17:00:21.142 (0s)&#xA;</system-err>
          </testcase>
          <testcase name="[It] [integration-service-suite Gitlab Status Reporting of Integration tests] Gitlab with status reporting of Integration tests in the assosiated merge request when Integration PipelineRun is created should eventually complete successfully [integration-service, gitlab-status-reporting]" classname="Red Hat App Studio E2E tests" status="passed" time="0.004824029">
              <system-err>&gt; Enter [It] should eventually complete successfully - /tmp/tmp.jToXo61xWY/repo/e2e-tests/tests/integration-service/gitlab-integration-reporting.go:218 @ 10/06/26 17:00:21.142&#xA;PipelineRun integration-test-hp2q-cbv9z reason: Succeeded&#xA;PipelineRun integration-test-3ykr-c82cw reason: Succeeded&#xA;&lt; Exit [It] should eventually complete successfully - /tmp/tmp.jToXo61xWY/repo/e2e-tests/tests/integration-service/gitlab-integration-reporting.go:218 @ 10/06/26 17:00:21.147 (5ms)&#xA;&gt; Enter [AfterEach] [integration-service-suite Gitlab Status Reporting of Integration tests] - /tmp/tmp.jToXo61xWY/repo/e2e-tests/tests/integration-service/gitlab-integration-reporting.go:41 @ 10/06/26 17:00:21.147&#xA;&lt; Exit [AfterEach] [integration-service-suite Gitlab Status Reporting of Integration tests] - /tmp/tmp.jToXo61xWY/repo/e2e-tests/tests/integration-service/gitlab-integration-reporting.go:41 @ 10/06/26 17:00:21.147 (0s)&#xA;</system-err>
          </testcase>
          <testcase name="[It] [integration-service-suite Gitlab Status Reporting of Integration tests] Gitlab with status reporting of Integration tests in the assosiated merge request when Integration PipelineRun is created validates the Integration test scenario PipelineRun is reported to merge request CommitStatus, and it pass [integration-service, gitlab-status-reporting]" classname="Red Hat App Studio E2E tests" status="passed" time="0.252195709">
              <system-err>&gt; Enter [It] validates the Integration test scenario PipelineRun is reported to merge request CommitStatus, and it pass - /tmp/tmp.jToXo61xWY/repo/e2e-tests/tests/integration-service/gitlab-integration-reporting.go:223 @ 10/06/26 17:00:21.147&#xA;&lt; Exit [It] validates the Integration test scenario PipelineRun is reported to merge request CommitStatus, and it pass - /tmp/tmp.jToXo61xWY/repo/e2e-tests/tests/integration-service/gitlab-integration-reporting.go:223 @ 10/06/26 17:00:21.399 (252ms)&#xA;&gt; Enter [AfterEach] [integration-service-suite Gitlab Status Reporting of Integration tests] - /tmp/tmp.jToXo61xWY/repo/e2e-tests/tests/integration-service/gitlab-integration-reporting.go:41 @ 10/06/26 17:00:21.399&#xA;&lt; Exit [AfterEach] [integration-service-suite Gitlab Status Reporting of Integration tests] - /tmp/tmp.jToXo61xWY/repo/e2e-tests/tests/integration-service/gitlab-integration-reporting.go:41 @ 10/06/26 17:00:21.399 (0s)&#xA;</system-err>
          </testcase>
          <testcase name="[It] [integration-service-suite Gitlab Status Reporting of Integration tests] Gitlab with status reporting of Integration tests in the assosiated merge request when Integration PipelineRun is created eventually leads to the integration test PipelineRun&#39;s Pass status reported at MR commit status [integration-service, gitlab-status-reporting]" classname="Red Hat App Studio E2E tests" status="passed" time="0.473738071">
              <system-err>&gt; Enter [It] eventually leads to the integration test PipelineRun&#39;s Pass status reported at MR commit status - /tmp/tmp.jToXo61xWY/repo/e2e-tests/tests/integration-service/gitlab-integration-reporting.go:240 @ 10/06/26 17:00:21.399&#xA;&lt; Exit [It] eventually leads to the integration test PipelineRun&#39;s Pass status reported at MR commit status - /tmp/tmp.jToXo61xWY/repo/e2e-tests/tests/integration-service/gitlab-integration-reporting.go:240 @ 10/06/26 17:00:21.873 (474ms)&#xA;&gt; Enter [AfterEach] [integration-service-suite Gitlab Status Reporting of Integration tests] - /tmp/tmp.jToXo61xWY/repo/e2e-tests/tests/integration-service/gitlab-integration-reporting.go:41 @ 10/06/26 17:00:21.873&#xA;&lt; Exit [AfterEach] [integration-service-suite Gitlab Status Reporting of Integration tests] - /tmp/tmp.jToXo61xWY/repo/e2e-tests/tests/integration-service/gitlab-integration-reporting.go:41 @ 10/06/26 17:00:21.873 (0s)&#xA;</system-err>
          </testcase>
          <testcase name="[It] [integration-service-suite Gitlab Status Reporting of Integration tests] Gitlab with status reporting of Integration tests in the assosiated merge request when Integration PipelineRun is created validates the Integration test scenario PipelineRun is reported to merge request CommitStatus, and it fails [integration-service, gitlab-status-reporting]" classname="Red Hat App Studio E2E tests" status="passed" time="0.506987639">
              <system-err>&gt; Enter [It] validates the Integration test scenario PipelineRun is reported to merge request CommitStatus, and it fails - /tmp/tmp.jToXo61xWY/repo/e2e-tests/tests/integration-service/gitlab-integration-reporting.go:244 @ 10/06/26 17:00:21.873&#xA;&lt; Exit [It] validates the Integration test scenario PipelineRun is reported to merge request CommitStatus, and it fails - /tmp/tmp.jToXo61xWY/repo/e2e-tests/tests/integration-service/gitlab-integration-reporting.go:244 @ 10/06/26 17:00:22.38 (507ms)&#xA;&gt; Enter [AfterEach] [integration-service-suite Gitlab Status Reporting of Integration tests] - /tmp/tmp.jToXo61xWY/repo/e2e-tests/tests/integration-service/gitlab-integration-reporting.go:41 @ 10/06/26 17:00:22.38&#xA;&lt; Exit [AfterEach] [integration-service-suite Gitlab Status Reporting of Integration tests] - /tmp/tmp.jToXo61xWY/repo/e2e-tests/tests/integration-service/gitlab-integration-reporting.go:41 @ 10/06/26 17:00:22.38 (0s)&#xA;</system-err>
          </testcase>
          <testcase name="[It] [integration-service-suite Gitlab Status Reporting of Integration tests] Gitlab with status reporting of Integration tests in the assosiated merge request when Integration PipelineRun is created eventually leads to the integration test PipelineRun&#39;s Fail status reported at MR commit status [integration-service, gitlab-status-reporting]" classname="Red Hat App Studio E2E tests" status="passed" time="0.416858895">
              <system-err>&gt; Enter [It] eventually leads to the integration test PipelineRun&#39;s Fail status reported at MR commit status - /tmp/tmp.jToXo61xWY/repo/e2e-tests/tests/integration-service/gitlab-integration-reporting.go:261 @ 10/06/26 17:00:22.38&#xA;&lt; Exit [It] eventually leads to the integration test PipelineRun&#39;s Fail status reported at MR commit status - /tmp/tmp.jToXo61xWY/repo/e2e-tests/tests/integration-service/gitlab-integration-reporting.go:261 @ 10/06/26 17:00:22.797 (417ms)&#xA;&gt; Enter [AfterEach] [integration-service-suite Gitlab Status Reporting of Integration tests] - /tmp/tmp.jToXo61xWY/repo/e2e-tests/tests/integration-service/gitlab-integration-reporting.go:41 @ 10/06/26 17:00:22.797&#xA;&lt; Exit [AfterEach] [integration-service-suite Gitlab Status Reporting of Integration tests] - /tmp/tmp.jToXo61xWY/repo/e2e-tests/tests/integration-service/gitlab-integration-reporting.go:41 @ 10/06/26 17:00:22.797 (0s)&#xA;</system-err>
          </testcase>
          <testcase name="[It] [integration-service-suite Gitlab Status Reporting of Integration tests] Gitlab with status reporting of Integration tests in the assosiated merge request when Integration PipelineRun is created validates at least one MR note contains the final integration test result [integration-service, gitlab-status-reporting]" classname="Red Hat App Studio E2E tests" status="passed" time="0.231511236">
              <system-err>&gt; Enter [It] validates at least one MR note contains the final integration test result - /tmp/tmp.jToXo61xWY/repo/e2e-tests/tests/integration-service/gitlab-integration-reporting.go:265 @ 10/06/26 17:00:22.797&#xA;&lt; Exit [It] validates at least one MR note contains the final integration test result - /tmp/tmp.jToXo61xWY/repo/e2e-tests/tests/integration-service/gitlab-integration-reporting.go:265 @ 10/06/26 17:00:23.029 (231ms)&#xA;&gt; Enter [AfterEach] [integration-service-suite Gitlab Status Reporting of Integration tests] - /tmp/tmp.jToXo61xWY/repo/e2e-tests/tests/integration-service/gitlab-integration-reporting.go:41 @ 10/06/26 17:00:23.029&#xA;&lt; Exit [AfterEach] [integration-service-suite Gitlab Status Reporting of Integration tests] - /tmp/tmp.jToXo61xWY/repo/e2e-tests/tests/integration-service/gitlab-integration-reporting.go:41 @ 10/06/26 17:00:23.029 (0s)&#xA;</system-err>
          </testcase>
          <testcase name="[It] [integration-service-suite Gitlab Status Reporting of Integration tests] Gitlab with status reporting of Integration tests in the assosiated merge request when Integration PipelineRun is created merging the PR should be successful [integration-service, gitlab-status-reporting]" classname="Red Hat App Studio E2E tests" status="passed" time="1.5886228230000001">
              <system-err>&gt; Enter [It] merging the PR should be successful - /tmp/tmp.jToXo61xWY/repo/e2e-tests/tests/integration-service/gitlab-integration-reporting.go:289 @ 10/06/26 17:00:23.029&#xA;merged result sha: 74b675c1b9753c80db845be2abb0b49a8d9e6d52 for MR #18676&#xA;&lt; Exit [It] merging the PR should be successful - /tmp/tmp.jToXo61xWY/repo/e2e-tests/tests/integration-service/gitlab-integration-reporting.go:289 @ 10/06/26 17:00:24.617 (1.589s)&#xA;&gt; Enter [AfterEach] [integration-service-suite Gitlab Status Reporting of Integration tests] - /tmp/tmp.jToXo61xWY/repo/e2e-tests/tests/integration-service/gitlab-integration-reporting.go:41 @ 10/06/26 17:00:24.617&#xA;&lt; Exit [AfterEach] [integration-service-suite Gitlab Status Reporting of Integration tests] - /tmp/tmp.jToXo61xWY/repo/e2e-tests/tests/integration-service/gitlab-integration-reporting.go:41 @ 10/06/26 17:00:24.617 (0s)&#xA;</system-err>
          </testcase>
          <testcase name="[It] [integration-service-suite Gitlab Status Reporting of Integration tests] Gitlab with status reporting of Integration tests in the assosiated merge request when Integration PipelineRun is created leads to triggering on push PipelineRun [integration-service, gitlab-status-reporting]" classname="Red Hat App Studio E2E tests" status="passed" time="0.006512636">
              <system-err>&gt; Enter [It] leads to triggering on push PipelineRun - /tmp/tmp.jToXo61xWY/repo/e2e-tests/tests/integration-service/gitlab-integration-reporting.go:299 @ 10/06/26 17:00:24.618&#xA;&lt; Exit [It] leads to triggering on push PipelineRun - /tmp/tmp.jToXo61xWY/repo/e2e-tests/tests/integration-service/gitlab-integration-reporting.go:299 @ 10/06/26 17:00:24.624 (6ms)&#xA;&gt; Enter [AfterEach] [integration-service-suite Gitlab Status Reporting of Integration tests] - /tmp/tmp.jToXo61xWY/repo/e2e-tests/tests/integration-service/gitlab-integration-reporting.go:41 @ 10/06/26 17:00:24.624&#xA;&lt; Exit [AfterEach] [integration-service-suite Gitlab Status Reporting of Integration tests] - /tmp/tmp.jToXo61xWY/repo/e2e-tests/tests/integration-service/gitlab-integration-reporting.go:41 @ 10/06/26 17:00:24.624 (0s)&#xA;</system-err>
          </testcase>
          <testcase name="[It] [integration-service-suite Gitlab Status Reporting of Integration tests] Gitlab with status reporting of Integration tests in the assosiated merge request when Run integration tests after Merged MR should eventually complete successfully [integration-service, gitlab-status-reporting]" classname="Red Hat App Studio E2E tests" status="passed" time="0.006345323">
              <system-err>&gt; Enter [It] should eventually complete successfully - /tmp/tmp.jToXo61xWY/repo/e2e-tests/tests/integration-service/gitlab-integration-reporting.go:314 @ 10/06/26 17:00:24.624&#xA;PipelineRun integration-test-hp2q-cbv9z reason: Succeeded&#xA;PipelineRun integration-test-3ykr-c82cw reason: Succeeded&#xA;&lt; Exit [It] should eventually complete successfully - /tmp/tmp.jToXo61xWY/repo/e2e-tests/tests/integration-service/gitlab-integration-reporting.go:314 @ 10/06/26 17:00:24.63 (6ms)&#xA;&gt; Enter [AfterEach] [integration-service-suite Gitlab Status Reporting of Integration tests] - /tmp/tmp.jToXo61xWY/repo/e2e-tests/tests/integration-service/gitlab-integration-reporting.go:41 @ 10/06/26 17:00:24.63&#xA;&lt; Exit [AfterEach] [integration-service-suite Gitlab Status Reporting of Integration tests] - /tmp/tmp.jToXo61xWY/repo/e2e-tests/tests/integration-service/gitlab-integration-reporting.go:41 @ 10/06/26 17:00:24.63 (0s)&#xA;</system-err>
          </testcase>
          <testcase name="[It] [integration-service-suite Gitlab Status Reporting of Integration tests] Gitlab with status reporting of Integration tests in the assosiated merge request when Run integration tests after Merged MR validates the Integration test scenario PipelineRun is reported to merge request CommitStatus, and it pass [integration-service, gitlab-status-reporting]" classname="Red Hat App Studio E2E tests" status="passed" time="0.237292766">
              <system-err>&gt; Enter [It] validates the Integration test scenario PipelineRun is reported to merge request CommitStatus, and it pass - /tmp/tmp.jToXo61xWY/repo/e2e-tests/tests/integration-service/gitlab-integration-reporting.go:319 @ 10/06/26 17:00:24.63&#xA;&lt; Exit [It] validates the Integration test scenario PipelineRun is reported to merge request CommitStatus, and it pass - /tmp/tmp.jToXo61xWY/repo/e2e-tests/tests/integration-service/gitlab-integration-reporting.go:319 @ 10/06/26 17:00:24.868 (237ms)&#xA;&gt; Enter [AfterEach] [integration-service-suite Gitlab Status Reporting of Integration tests] - /tmp/tmp.jToXo61xWY/repo/e2e-tests/tests/integration-service/gitlab-integration-reporting.go:41 @ 10/06/26 17:00:24.868&#xA;&lt; Exit [AfterEach] [integration-service-suite Gitlab Status Reporting of Integration tests] - /tmp/tmp.jToXo61xWY/repo/e2e-tests/tests/integration-service/gitlab-integration-reporting.go:41 @ 10/06/26 17:00:24.868 (0s)&#xA;</system-err>
          </testcase>
          <testcase name="[It] [integration-service-suite Gitlab Status Reporting of Integration tests] Gitlab with status reporting of Integration tests in the assosiated merge request when Run integration tests after Merged MR eventually leads to the integration test PipelineRun&#39;s Pass status reported at MR commit status [integration-service, gitlab-status-reporting]" classname="Red Hat App Studio E2E tests" status="passed" time="0.572672983">
              <system-err>&gt; Enter [It] eventually leads to the integration test PipelineRun&#39;s Pass status reported at MR commit status - /tmp/tmp.jToXo61xWY/repo/e2e-tests/tests/integration-service/gitlab-integration-reporting.go:336 @ 10/06/26 17:00:24.868&#xA;&lt; Exit [It] eventually leads to the integration test PipelineRun&#39;s Pass status reported at MR commit status - /tmp/tmp.jToXo61xWY/repo/e2e-tests/tests/integration-service/gitlab-integration-reporting.go:336 @ 10/06/26 17:00:25.441 (573ms)&#xA;&gt; Enter [AfterEach] [integration-service-suite Gitlab Status Reporting of Integration tests] - /tmp/tmp.jToXo61xWY/repo/e2e-tests/tests/integration-service/gitlab-integration-reporting.go:41 @ 10/06/26 17:00:25.441&#xA;&lt; Exit [AfterEach] [integration-service-suite Gitlab Status Reporting of Integration tests] - /tmp/tmp.jToXo61xWY/repo/e2e-tests/tests/integration-service/gitlab-integration-reporting.go:41 @ 10/06/26 17:00:25.441 (0s)&#xA;</system-err>
          </testcase>
          <testcase name="[It] [integration-service-suite Gitlab Status Reporting of Integration tests] Gitlab with status reporting of Integration tests in the assosiated merge request when Run integration tests after Merged MR validates the Integration test scenario PipelineRun is reported to merge request CommitStatus, and it fails [integration-service, gitlab-status-reporting]" classname="Red Hat App Studio E2E tests" status="passed" time="0.201236296">
              <system-err>&gt; Enter [It] validates the Integration test scenario PipelineRun is reported to merge request CommitStatus, and it fails - /tmp/tmp.jToXo61xWY/repo/e2e-tests/tests/integration-service/gitlab-integration-reporting.go:340 @ 10/06/26 17:00:25.441&#xA;&lt; Exit [It] validates the Integration test scenario PipelineRun is reported to merge request CommitStatus, and it fails - /tmp/tmp.jToXo61xWY/repo/e2e-tests/tests/integration-service/gitlab-integration-reporting.go:340 @ 10/06/26 17:00:25.642 (201ms)&#xA;&gt; Enter [AfterEach] [integration-service-suite Gitlab Status Reporting of Integration tests] - /tmp/tmp.jToXo61xWY/repo/e2e-tests/tests/integration-service/gitlab-integration-reporting.go:41 @ 10/06/26 17:00:25.642&#xA;&lt; Exit [AfterEach] [integration-service-suite Gitlab Status Reporting of Integration tests] - /tmp/tmp.jToXo61xWY/repo/e2e-tests/tests/integration-service/gitlab-integration-reporting.go:41 @ 10/06/26 17:00:25.642 (0s)&#xA;</system-err>
          </testcase>
          <testcase name="[It] [integration-service-suite Gitlab Status Reporting of Integration tests] Gitlab with status reporting of Integration tests in the assosiated merge request when Run integration tests after Merged MR eventually leads to the integration test PipelineRun&#39;s Fail status reported at MR commit status [integration-service, gitlab-status-reporting]" classname="Red Hat App Studio E2E tests" status="passed" time="2.97022233">
              <system-err>&gt; Enter [It] eventually leads to the integration test PipelineRun&#39;s Fail status reported at MR commit status - /tmp/tmp.jToXo61xWY/repo/e2e-tests/tests/integration-service/gitlab-integration-reporting.go:357 @ 10/06/26 17:00:25.642&#xA;&lt; Exit [It] eventually leads to the integration test PipelineRun&#39;s Fail status reported at MR commit status - /tmp/tmp.jToXo61xWY/repo/e2e-tests/tests/integration-service/gitlab-integration-reporting.go:357 @ 10/06/26 17:00:26.153 (511ms)&#xA;&gt; Enter [AfterAll] Gitlab with status reporting of Integration tests in the assosiated merge request - /tmp/tmp.jToXo61xWY/repo/e2e-tests/tests/integration-service/gitlab-integration-reporting.go:105 @ 10/06/26 17:00:26.153&#xA;&lt; Exit [AfterAll] Gitlab with status reporting of Integration tests in the assosiated merge request - /tmp/tmp.jToXo61xWY/repo/e2e-tests/tests/integration-service/gitlab-integration-reporting.go:105 @ 10/06/26 17:00:28.612 (2.459s)&#xA;&gt; Enter [AfterEach] [integration-service-suite Gitlab Status Reporting of Integration tests] - /tmp/tmp.jToXo61xWY/repo/e2e-tests/tests/integration-service/gitlab-integration-reporting.go:41 @ 10/06/26 17:00:28.612&#xA;&lt; Exit [AfterEach] [integration-service-suite Gitlab Status Reporting of Integration tests] - /tmp/tmp.jToXo61xWY/repo/e2e-tests/tests/integration-service/gitlab-integration-reporting.go:41 @ 10/06/26 17:00:28.612 (0s)&#xA;</system-err>
          </testcase>
          <testcase name="[It] [integration-service-suite Integration Service E2E tests] with happy path for general flow of Integration service when a new Component is created triggers a build PipelineRun [integration-service]" classname="Red Hat App Studio E2E tests" status="passed" time="21.615523178">
              <system-err>&gt; Enter [BeforeAll] with happy path for general flow of Integration service - /tmp/tmp.jToXo61xWY/repo/e2e-tests/tests/integration-service/integration.go:52 @ 10/06/26 17:00:28.612&#xA;Image repository for component test-component-pac-sxpr4z in namespace integration1-3ylg do not have right state (&#39;&#39; != &#39;ready&#39;) yet but it has status {  { } {&lt;nil&gt;    } []}.&#xA;&lt; Exit [BeforeAll] with happy path for general flow of Integration service - /tmp/tmp.jToXo61xWY/repo/e2e-tests/tests/integration-service/integration.go:52 @ 10/06/26 17:00:50.222 (21.61s)&#xA;&gt; Enter [It] triggers a build PipelineRun - /tmp/tmp.jToXo61xWY/repo/e2e-tests/tests/integration-service/integration.go:85 @ 10/06/26 17:00:50.222&#xA;&lt; Exit [It] triggers a build PipelineRun - /tmp/tmp.jToXo61xWY/repo/e2e-tests/tests/integration-service/integration.go:85 @ 10/06/26 17:00:50.228 (6ms)&#xA;&gt; Enter [AfterEach] [integration-service-suite Integration Service E2E tests] - /tmp/tmp.jToXo61xWY/repo/e2e-tests/tests/integration-service/integration.go:49 @ 10/06/26 17:00:50.228&#xA;&lt; Exit [AfterEach] [integration-service-suite Integration Service E2E tests] - /tmp/tmp.jToXo61xWY/repo/e2e-tests/tests/integration-service/integration.go:49 @ 10/06/26 17:00:50.228 (0s)&#xA;</system-err>
          </testcase>
          <testcase name="[It] [integration-service-suite Integration Service E2E tests] with happy path for general flow of Integration service when a new Component is created verifies if the build PipelineRun contains the finalizer [integration-service]" classname="Red Hat App Studio E2E tests" status="passed" time="0.004709406">
              <system-err>&gt; Enter [It] verifies if the build PipelineRun contains the finalizer - /tmp/tmp.jToXo61xWY/repo/e2e-tests/tests/integration-service/integration.go:90 @ 10/06/26 17:00:50.228&#xA;&lt; Exit [It] verifies if the build PipelineRun contains the finalizer - /tmp/tmp.jToXo61xWY/repo/e2e-tests/tests/integration-service/integration.go:90 @ 10/06/26 17:00:50.233 (5ms)&#xA;&gt; Enter [AfterEach] [integration-service-suite Integration Service E2E tests] - /tmp/tmp.jToXo61xWY/repo/e2e-tests/tests/integration-service/integration.go:49 @ 10/06/26 17:00:50.233&#xA;&lt; Exit [AfterEach] [integration-service-suite Integration Service E2E tests] - /tmp/tmp.jToXo61xWY/repo/e2e-tests/tests/integration-service/integration.go:49 @ 10/06/26 17:00:50.233 (0s)&#xA;</system-err>
          </testcase>
          <testcase name="[It] [integration-service-suite Integration Service E2E tests] with happy path for general flow of Integration service when a new Component is created waits for build PipelineRun to succeed [integration-service]" classname="Red Hat App Studio E2E tests" status="passed" time="220.008011976">
              <system-err>&gt; Enter [It] waits for build PipelineRun to succeed - /tmp/tmp.jToXo61xWY/repo/e2e-tests/tests/integration-service/integration.go:101 @ 10/06/26 17:00:50.233&#xA;PipelineRun test-component-pac-sxpr4z-on-pull-request-qmtkf found for Component integration1-3ylg/test-component-pac-sxpr4z&#xA;PipelineRun test-component-pac-sxpr4z-on-pull-request-qmtkf reason: ResolvingTaskRef&#xA;PipelineRun test-component-pac-sxpr4z-on-pull-request-qmtkf reason: Running&#xA;PipelineRun test-component-pac-sxpr4z-on-pull-request-qmtkf reason: Running&#xA;PipelineRun test-component-pac-sxpr4z-on-pull-request-qmtkf reason: Running&#xA;PipelineRun test-component-pac-sxpr4z-on-pull-request-qmtkf reason: Running&#xA;PipelineRun test-component-pac-sxpr4z-on-pull-request-qmtkf reason: Running&#xA;PipelineRun test-component-pac-sxpr4z-on-pull-request-qmtkf reason: Running&#xA;PipelineRun test-component-pac-sxpr4z-on-pull-request-qmtkf reason: Running&#xA;PipelineRun test-component-pac-sxpr4z-on-pull-request-qmtkf reason: Running&#xA;PipelineRun test-component-pac-sxpr4z-on-pull-request-qmtkf reason: Running&#xA;PipelineRun test-component-pac-sxpr4z-on-pull-request-qmtkf reason: Running&#xA;PipelineRun integration-test-hdmg-wk9c5 reason: Succeeded&#xA;&lt; Exit [It] waits for build PipelineRun to succeed - /tmp/tmp.jToXo61xWY/repo/e2e-tests/tests/integration-service/integration.go:101 @ 10/06/26 17:04:30.241 (3m40.008s)&#xA;&gt; Enter [AfterEach] [integration-service-suite Integration Service E2E tests] - /tmp/tmp.jToXo61xWY/repo/e2e-tests/tests/integration-service/integration.go:49 @ 10/06/26 17:04:30.241&#xA;&lt; Exit [AfterEach] [integration-service-suite Integration Service E2E tests] - /tmp/tmp.jToXo61xWY/repo/e2e-tests/tests/integration-service/integration.go:49 @ 10/06/26 17:04:30.241 (0s)&#xA;</system-err>
          </testcase>
          <testcase name="[It] [integration-service-suite Integration Service E2E tests] with happy path for general flow of Integration service when a new Component is created should have a related PaC init PR created [integration-service]" classname="Red Hat App Studio E2E tests" status="passed" time="0.249502307">
              <system-err>&gt; Enter [It] should have a related PaC init PR created - /tmp/tmp.jToXo61xWY/repo/e2e-tests/tests/integration-service/integration.go:107 @ 10/06/26 17:04:30.241&#xA;&lt; Exit [It] should have a related PaC init PR created - /tmp/tmp.jToXo61xWY/repo/e2e-tests/tests/integration-service/integration.go:107 @ 10/06/26 17:04:30.49 (249ms)&#xA;&gt; Enter [AfterEach] [integration-service-suite Integration Service E2E tests] - /tmp/tmp.jToXo61xWY/repo/e2e-tests/tests/integration-service/integration.go:49 @ 10/06/26 17:04:30.49&#xA;&lt; Exit [AfterEach] [integration-service-suite Integration Service E2E tests] - /tmp/tmp.jToXo61xWY/repo/e2e-tests/tests/integration-service/integration.go:49 @ 10/06/26 17:04:30.49 (0s)&#xA;</system-err>
          </testcase>
          <testcase name="[It] [integration-service-suite Integration Service E2E tests] with happy path for general flow of Integration service when the build pipelineRun run succeeded checks if the BuildPipelineRun have the annotation of chains signed [integration-service]" classname="Red Hat App Studio E2E tests" status="passed" time="0.008353057">
              <system-err>&gt; Enter [It] checks if the BuildPipelineRun have the annotation of chains signed - /tmp/tmp.jToXo61xWY/repo/e2e-tests/tests/integration-service/integration.go:128 @ 10/06/26 17:04:30.49&#xA;&lt; Exit [It] checks if the BuildPipelineRun have the annotation of chains signed - /tmp/tmp.jToXo61xWY/repo/e2e-tests/tests/integration-service/integration.go:128 @ 10/06/26 17:04:30.499 (8ms)&#xA;&gt; Enter [AfterEach] [integration-service-suite Integration Service E2E tests] - /tmp/tmp.jToXo61xWY/repo/e2e-tests/tests/integration-service/integration.go:49 @ 10/06/26 17:04:30.499&#xA;&lt; Exit [AfterEach] [integration-service-suite Integration Service E2E tests] - /tmp/tmp.jToXo61xWY/repo/e2e-tests/tests/integration-service/integration.go:49 @ 10/06/26 17:04:30.499 (0s)&#xA;</system-err>
          </testcase>
          <testcase name="[It] [integration-service-suite Integration Service E2E tests] with happy path for general flow of Integration service when the build pipelineRun run succeeded checks if the Snapshot is created [integration-service]" classname="Red Hat App Studio E2E tests" status="passed" time="0.002387483">
              <system-err>&gt; Enter [It] checks if the Snapshot is created - /tmp/tmp.jToXo61xWY/repo/e2e-tests/tests/integration-service/integration.go:132 @ 10/06/26 17:04:30.499&#xA;&lt; Exit [It] checks if the Snapshot is created - /tmp/tmp.jToXo61xWY/repo/e2e-tests/tests/integration-service/integration.go:132 @ 10/06/26 17:04:30.501 (2ms)&#xA;&gt; Enter [AfterEach] [integration-service-suite Integration Service E2E tests] - /tmp/tmp.jToXo61xWY/repo/e2e-tests/tests/integration-service/integration.go:49 @ 10/06/26 17:04:30.501&#xA;&lt; Exit [AfterEach] [integration-service-suite Integration Service E2E tests] - /tmp/tmp.jToXo61xWY/repo/e2e-tests/tests/integration-service/integration.go:49 @ 10/06/26 17:04:30.501 (0s)&#xA;</system-err>
          </testcase>
          <testcase name="[It] [integration-service-suite Integration Service E2E tests] with happy path for general flow of Integration service when the build pipelineRun run succeeded checks if the Build PipelineRun got annotated with Snapshot name [integration-service]" classname="Red Hat App Studio E2E tests" status="passed" time="0.007680142">
              <system-err>&gt; Enter [It] checks if the Build PipelineRun got annotated with Snapshot name - /tmp/tmp.jToXo61xWY/repo/e2e-tests/tests/integration-service/integration.go:137 @ 10/06/26 17:04:30.501&#xA;&lt; Exit [It] checks if the Build PipelineRun got annotated with Snapshot name - /tmp/tmp.jToXo61xWY/repo/e2e-tests/tests/integration-service/integration.go:137 @ 10/06/26 17:04:30.509 (8ms)&#xA;&gt; Enter [AfterEach] [integration-service-suite Integration Service E2E tests] - /tmp/tmp.jToXo61xWY/repo/e2e-tests/tests/integration-service/integration.go:49 @ 10/06/26 17:04:30.509&#xA;&lt; Exit [AfterEach] [integration-service-suite Integration Service E2E tests] - /tmp/tmp.jToXo61xWY/repo/e2e-tests/tests/integration-service/integration.go:49 @ 10/06/26 17:04:30.509 (0s)&#xA;</system-err>
          </testcase>
          <testcase name="[It] [integration-service-suite Integration Service E2E tests] with happy path for general flow of Integration service when the build pipelineRun run succeeded verifies that the finalizer has been removed from the build pipelinerun [integration-service]" classname="Red Hat App Studio E2E tests" status="passed" time="0.003788274">
              <system-err>&gt; Enter [It] verifies that the finalizer has been removed from the build pipelinerun - /tmp/tmp.jToXo61xWY/repo/e2e-tests/tests/integration-service/integration.go:141 @ 10/06/26 17:04:30.509&#xA;&lt; Exit [It] verifies that the finalizer has been removed from the build pipelinerun - /tmp/tmp.jToXo61xWY/repo/e2e-tests/tests/integration-service/integration.go:141 @ 10/06/26 17:04:30.513 (4ms)&#xA;&gt; Enter [AfterEach] [integration-service-suite Integration Service E2E tests] - /tmp/tmp.jToXo61xWY/repo/e2e-tests/tests/integration-service/integration.go:49 @ 10/06/26 17:04:30.513&#xA;&lt; Exit [AfterEach] [integration-service-suite Integration Service E2E tests] - /tmp/tmp.jToXo61xWY/repo/e2e-tests/tests/integration-service/integration.go:49 @ 10/06/26 17:04:30.513 (0s)&#xA;</system-err>
          </testcase>
          <testcase name="[It] [integration-service-suite Integration Service E2E tests] with happy path for general flow of Integration service when the build pipelineRun run succeeded checks if all of the integrationPipelineRuns passed [integration-service, slow]" classname="Red Hat App Studio E2E tests" status="passed" time="0.00446057">
              <system-err>&gt; Enter [It] checks if all of the integrationPipelineRuns passed - /tmp/tmp.jToXo61xWY/repo/e2e-tests/tests/integration-service/integration.go:154 @ 10/06/26 17:04:30.513&#xA;Integration test scenario integration-test-hdmg is found&#xA;PipelineRun integration-test-hdmg-wk9c5 reason: Succeeded&#xA;&lt; Exit [It] checks if all of the integrationPipelineRuns passed - /tmp/tmp.jToXo61xWY/repo/e2e-tests/tests/integration-service/integration.go:154 @ 10/06/26 17:04:30.517 (4ms)&#xA;&gt; Enter [AfterEach] [integration-service-suite Integration Service E2E tests] - /tmp/tmp.jToXo61xWY/repo/e2e-tests/tests/integration-service/integration.go:49 @ 10/06/26 17:04:30.517&#xA;&lt; Exit [AfterEach] [integration-service-suite Integration Service E2E tests] - /tmp/tmp.jToXo61xWY/repo/e2e-tests/tests/integration-service/integration.go:49 @ 10/06/26 17:04:30.517 (0s)&#xA;</system-err>
          </testcase>
          <testcase name="[It] [integration-service-suite Integration Service E2E tests] with happy path for general flow of Integration service when the build pipelineRun run succeeded checks if the passed status of integration test is reported in the Snapshot [integration-service]" classname="Red Hat App Studio E2E tests" status="passed" time="0.003444217">
              <system-err>&gt; Enter [It] checks if the passed status of integration test is reported in the Snapshot - /tmp/tmp.jToXo61xWY/repo/e2e-tests/tests/integration-service/integration.go:158 @ 10/06/26 17:04:30.517&#xA;&lt; Exit [It] checks if the passed status of integration test is reported in the Snapshot - /tmp/tmp.jToXo61xWY/repo/e2e-tests/tests/integration-service/integration.go:158 @ 10/06/26 17:04:30.521 (3ms)&#xA;&gt; Enter [AfterEach] [integration-service-suite Integration Service E2E tests] - /tmp/tmp.jToXo61xWY/repo/e2e-tests/tests/integration-service/integration.go:49 @ 10/06/26 17:04:30.521&#xA;&lt; Exit [AfterEach] [integration-service-suite Integration Service E2E tests] - /tmp/tmp.jToXo61xWY/repo/e2e-tests/tests/integration-service/integration.go:49 @ 10/06/26 17:04:30.521 (0s)&#xA;</system-err>
          </testcase>
          <testcase name="[It] [integration-service-suite Integration Service E2E tests] with happy path for general flow of Integration service when the build pipelineRun run succeeded checks if the skipped integration test is absent from the Snapshot&#39;s status annotation [integration-service]" classname="Red Hat App Studio E2E tests" status="passed" time="0.003028258">
              <system-err>&gt; Enter [It] checks if the skipped integration test is absent from the Snapshot&#39;s status annotation - /tmp/tmp.jToXo61xWY/repo/e2e-tests/tests/integration-service/integration.go:173 @ 10/06/26 17:04:30.521&#xA;&lt; Exit [It] checks if the skipped integration test is absent from the Snapshot&#39;s status annotation - /tmp/tmp.jToXo61xWY/repo/e2e-tests/tests/integration-service/integration.go:173 @ 10/06/26 17:04:30.524 (3ms)&#xA;&gt; Enter [AfterEach] [integration-service-suite Integration Service E2E tests] - /tmp/tmp.jToXo61xWY/repo/e2e-tests/tests/integration-service/integration.go:49 @ 10/06/26 17:04:30.524&#xA;&lt; Exit [AfterEach] [integration-service-suite Integration Service E2E tests] - /tmp/tmp.jToXo61xWY/repo/e2e-tests/tests/integration-service/integration.go:49 @ 10/06/26 17:04:30.524 (0s)&#xA;</system-err>
          </testcase>
          <testcase name="[It] [integration-service-suite Integration Service E2E tests] with happy path for general flow of Integration service when the build pipelineRun run succeeded checks if the finalizer was removed from all of the related Integration pipelineRuns [integration-service]" classname="Red Hat App Studio E2E tests" status="passed" time="0.00448945">
              <system-err>&gt; Enter [It] checks if the finalizer was removed from all of the related Integration pipelineRuns - /tmp/tmp.jToXo61xWY/repo/e2e-tests/tests/integration-service/integration.go:183 @ 10/06/26 17:04:30.524&#xA;Integration test scenario integration-test-hdmg is found&#xA;&lt; Exit [It] checks if the finalizer was removed from all of the related Integration pipelineRuns - /tmp/tmp.jToXo61xWY/repo/e2e-tests/tests/integration-service/integration.go:183 @ 10/06/26 17:04:30.528 (4ms)&#xA;&gt; Enter [AfterEach] [integration-service-suite Integration Service E2E tests] - /tmp/tmp.jToXo61xWY/repo/e2e-tests/tests/integration-service/integration.go:49 @ 10/06/26 17:04:30.528&#xA;&lt; Exit [AfterEach] [integration-service-suite Integration Service E2E tests] - /tmp/tmp.jToXo61xWY/repo/e2e-tests/tests/integration-service/integration.go:49 @ 10/06/26 17:04:30.528 (0s)&#xA;</system-err>
          </testcase>
          <testcase name="[It] [integration-service-suite Integration Service E2E tests] with happy path for general flow of Integration service creates a ReleasePlan [integration-service]" classname="Red Hat App Studio E2E tests" status="passed" time="0.202768543">
              <system-err>&gt; Enter [It] creates a ReleasePlan - /tmp/tmp.jToXo61xWY/repo/e2e-tests/tests/integration-service/integration.go:188 @ 10/06/26 17:04:30.528&#xA;IntegrationTestScenario integration-test-hdmg is found&#xA;IntegrationTestScenario skipped-its is found&#xA;&lt; Exit [It] creates a ReleasePlan - /tmp/tmp.jToXo61xWY/repo/e2e-tests/tests/integration-service/integration.go:188 @ 10/06/26 17:04:30.731 (203ms)&#xA;&gt; Enter [AfterEach] [integration-service-suite Integration Service E2E tests] - /tmp/tmp.jToXo61xWY/repo/e2e-tests/tests/integration-service/integration.go:49 @ 10/06/26 17:04:30.731&#xA;&lt; Exit [AfterEach] [integration-service-suite Integration Service E2E tests] - /tmp/tmp.jToXo61xWY/repo/e2e-tests/tests/integration-service/integration.go:49 @ 10/06/26 17:04:30.731 (0s)&#xA;</system-err>
          </testcase>
          <testcase name="[It] [integration-service-suite Integration Service E2E tests] with happy path for general flow of Integration service creates an snapshot of push event [integration-service]" classname="Red Hat App Studio E2E tests" status="passed" time="0.007468217">
              <system-err>&gt; Enter [It] creates an snapshot of push event - /tmp/tmp.jToXo61xWY/repo/e2e-tests/tests/integration-service/integration.go:198 @ 10/06/26 17:04:30.731&#xA;&lt; Exit [It] creates an snapshot of push event - /tmp/tmp.jToXo61xWY/repo/e2e-tests/tests/integration-service/integration.go:198 @ 10/06/26 17:04:30.739 (7ms)&#xA;&gt; Enter [AfterEach] [integration-service-suite Integration Service E2E tests] - /tmp/tmp.jToXo61xWY/repo/e2e-tests/tests/integration-service/integration.go:49 @ 10/06/26 17:04:30.739&#xA;&lt; Exit [AfterEach] [integration-service-suite Integration Service E2E tests] - /tmp/tmp.jToXo61xWY/repo/e2e-tests/tests/integration-service/integration.go:49 @ 10/06/26 17:04:30.739 (0s)&#xA;</system-err>
          </testcase>
          <testcase name="[It] [integration-service-suite Integration Service E2E tests] with happy path for general flow of Integration service when An snapshot of push event is created checks if the global candidate is updated after push event [integration-service]" classname="Red Hat App Studio E2E tests" status="passed" time="0.005783439">
              <system-err>&gt; Enter [It] checks if the global candidate is updated after push event - /tmp/tmp.jToXo61xWY/repo/e2e-tests/tests/integration-service/integration.go:205 @ 10/06/26 17:04:30.739&#xA;&lt; Exit [It] checks if the global candidate is updated after push event - /tmp/tmp.jToXo61xWY/repo/e2e-tests/tests/integration-service/integration.go:205 @ 10/06/26 17:04:30.744 (6ms)&#xA;&gt; Enter [AfterEach] [integration-service-suite Integration Service E2E tests] - /tmp/tmp.jToXo61xWY/repo/e2e-tests/tests/integration-service/integration.go:49 @ 10/06/26 17:04:30.744&#xA;&lt; Exit [AfterEach] [integration-service-suite Integration Service E2E tests] - /tmp/tmp.jToXo61xWY/repo/e2e-tests/tests/integration-service/integration.go:49 @ 10/06/26 17:04:30.745 (0s)&#xA;</system-err>
          </testcase>
          <testcase name="[It] [integration-service-suite Integration Service E2E tests] with happy path for general flow of Integration service when An snapshot of push event is created checks if all of the integrationPipelineRuns created by push event passed [integration-service, slow]" classname="Red Hat App Studio E2E tests" status="passed" time="20.096355174">
              <system-err>&gt; Enter [It] checks if all of the integrationPipelineRuns created by push event passed - /tmp/tmp.jToXo61xWY/repo/e2e-tests/tests/integration-service/integration.go:218 @ 10/06/26 17:04:30.745&#xA;Integration test scenario integration-test-hdmg is found&#xA;PipelineRun integration-test-hdmg-l92zn reason: ResolvingPipelineRef&#xA;PipelineRun integration-test-hdmg-l92zn reason: Succeeded&#xA;&lt; Exit [It] checks if all of the integrationPipelineRuns created by push event passed - /tmp/tmp.jToXo61xWY/repo/e2e-tests/tests/integration-service/integration.go:218 @ 10/06/26 17:04:50.841 (20.096s)&#xA;&gt; Enter [AfterEach] [integration-service-suite Integration Service E2E tests] - /tmp/tmp.jToXo61xWY/repo/e2e-tests/tests/integration-service/integration.go:49 @ 10/06/26 17:04:50.841&#xA;&lt; Exit [AfterEach] [integration-service-suite Integration Service E2E tests] - /tmp/tmp.jToXo61xWY/repo/e2e-tests/tests/integration-service/integration.go:49 @ 10/06/26 17:04:50.841 (0s)&#xA;</system-err>
          </testcase>
          <testcase name="[It] [integration-service-suite Integration Service E2E tests] with happy path for general flow of Integration service when An snapshot of push event is created checks if a Release is created successfully [integration-service]" classname="Red Hat App Studio E2E tests" status="passed" time="49.283981014">
              <system-err>&gt; Enter [It] checks if a Release is created successfully - /tmp/tmp.jToXo61xWY/repo/e2e-tests/tests/integration-service/integration.go:222 @ 10/06/26 17:04:50.841&#xA;&lt; Exit [It] checks if a Release is created successfully - /tmp/tmp.jToXo61xWY/repo/e2e-tests/tests/integration-service/integration.go:222 @ 10/06/26 17:04:50.844 (3ms)&#xA;&gt; Enter [AfterAll] with happy path for general flow of Integration service - /tmp/tmp.jToXo61xWY/repo/e2e-tests/tests/integration-service/integration.go:68 @ 10/06/26 17:04:50.844&#xA;&lt; Exit [AfterAll] with happy path for general flow of Integration service - /tmp/tmp.jToXo61xWY/repo/e2e-tests/tests/integration-service/integration.go:68 @ 10/06/26 17:05:40.125 (49.281s)&#xA;&gt; Enter [AfterEach] [integration-service-suite Integration Service E2E tests] - /tmp/tmp.jToXo61xWY/repo/e2e-tests/tests/integration-service/integration.go:49 @ 10/06/26 17:05:40.125&#xA;&lt; Exit [AfterEach] [integration-service-suite Integration Service E2E tests] - /tmp/tmp.jToXo61xWY/repo/e2e-tests/tests/integration-service/integration.go:49 @ 10/06/26 17:05:40.125 (0s)&#xA;</system-err>
          </testcase>
          <testcase name="[It] [integration-service-suite Integration Service E2E tests] with an integration test fail triggers a build PipelineRun [integration-service]" classname="Red Hat App Studio E2E tests" status="passed" time="231.511966391">
              <system-err>&gt; Enter [BeforeAll] with an integration test fail - /tmp/tmp.jToXo61xWY/repo/e2e-tests/tests/integration-service/integration.go:234 @ 10/06/26 17:05:40.125&#xA;&lt; Exit [BeforeAll] with an integration test fail - /tmp/tmp.jToXo61xWY/repo/e2e-tests/tests/integration-service/integration.go:234 @ 10/06/26 17:05:51.618 (11.493s)&#xA;&gt; Enter [It] triggers a build PipelineRun - /tmp/tmp.jToXo61xWY/repo/e2e-tests/tests/integration-service/integration.go:266 @ 10/06/26 17:05:51.618&#xA;no pipelinerun found for component test-component-pac-afsfte (application: integ-app-86ic, namespace: integration2-vdpf)PipelineRun test-component-pac-afsfte-on-pull-request-tld9t found for Component integration2-vdpf/test-component-pac-afsfte&#xA;PipelineRun test-component-pac-afsfte-on-pull-request-tld9t reason: Running&#xA;PipelineRun test-component-pac-afsfte-on-pull-request-tld9t reason: Running&#xA;PipelineRun test-component-pac-afsfte-on-pull-request-tld9t reason: Running&#xA;PipelineRun test-component-pac-afsfte-on-pull-request-tld9t reason: Running&#xA;PipelineRun test-component-pac-afsfte-on-pull-request-tld9t reason: Running&#xA;PipelineRun test-component-pac-afsfte-on-pull-request-tld9t reason: Running&#xA;PipelineRun test-component-pac-afsfte-on-pull-request-tld9t reason: Running&#xA;PipelineRun test-component-pac-afsfte-on-pull-request-tld9t reason: Running&#xA;PipelineRun test-component-pac-afsfte-on-pull-request-tld9t reason: Running&#xA;PipelineRun test-component-pac-afsfte-on-pull-request-tld9t reason: Running&#xA;PipelineRun integration-test-sl1w-2mw97 reason: Succeeded&#xA;&lt; Exit [It] triggers a build PipelineRun - /tmp/tmp.jToXo61xWY/repo/e2e-tests/tests/integration-service/integration.go:266 @ 10/06/26 17:09:31.637 (3m40.019s)&#xA;&gt; Enter [AfterEach] [integration-service-suite Integration Service E2E tests] - /tmp/tmp.jToXo61xWY/repo/e2e-tests/tests/integration-service/integration.go:49 @ 10/06/26 17:09:31.637&#xA;&lt; Exit [AfterEach] [integration-service-suite Integration Service E2E tests] - /tmp/tmp.jToXo61xWY/repo/e2e-tests/tests/integration-service/integration.go:49 @ 10/06/26 17:09:31.637 (0s)&#xA;</system-err>
          </testcase>
          <testcase name="[It] [integration-service-suite Integration Service E2E tests] with an integration test fail should have a related PaC init PR created [integration-service]" classname="Red Hat App Studio E2E tests" status="passed" time="0.251007112">
              <system-err>&gt; Enter [It] should have a related PaC init PR created - /tmp/tmp.jToXo61xWY/repo/e2e-tests/tests/integration-service/integration.go:273 @ 10/06/26 17:09:31.637&#xA;&lt; Exit [It] should have a related PaC init PR created - /tmp/tmp.jToXo61xWY/repo/e2e-tests/tests/integration-service/integration.go:273 @ 10/06/26 17:09:31.888 (251ms)&#xA;&gt; Enter [AfterEach] [integration-service-suite Integration Service E2E tests] - /tmp/tmp.jToXo61xWY/repo/e2e-tests/tests/integration-service/integration.go:49 @ 10/06/26 17:09:31.888&#xA;&lt; Exit [AfterEach] [integration-service-suite Integration Service E2E tests] - /tmp/tmp.jToXo61xWY/repo/e2e-tests/tests/integration-service/integration.go:49 @ 10/06/26 17:09:31.888 (0s)&#xA;</system-err>
          </testcase>
          <testcase name="[It] [integration-service-suite Integration Service E2E tests] with an integration test fail checks if the BuildPipelineRun have the annotation of chains signed [integration-service]" classname="Red Hat App Studio E2E tests" status="passed" time="0.008073091">
              <system-err>&gt; Enter [It] checks if the BuildPipelineRun have the annotation of chains signed - /tmp/tmp.jToXo61xWY/repo/e2e-tests/tests/integration-service/integration.go:292 @ 10/06/26 17:09:31.888&#xA;&lt; Exit [It] checks if the BuildPipelineRun have the annotation of chains signed - /tmp/tmp.jToXo61xWY/repo/e2e-tests/tests/integration-service/integration.go:292 @ 10/06/26 17:09:31.896 (8ms)&#xA;&gt; Enter [AfterEach] [integration-service-suite Integration Service E2E tests] - /tmp/tmp.jToXo61xWY/repo/e2e-tests/tests/integration-service/integration.go:49 @ 10/06/26 17:09:31.896&#xA;&lt; Exit [AfterEach] [integration-service-suite Integration Service E2E tests] - /tmp/tmp.jToXo61xWY/repo/e2e-tests/tests/integration-service/integration.go:49 @ 10/06/26 17:09:31.896 (0s)&#xA;</system-err>
          </testcase>
          <testcase name="[It] [integration-service-suite Integration Service E2E tests] with an integration test fail checks if the Snapshot is created [integration-service]" classname="Red Hat App Studio E2E tests" status="passed" time="0.002633569">
              <system-err>&gt; Enter [It] checks if the Snapshot is created - /tmp/tmp.jToXo61xWY/repo/e2e-tests/tests/integration-service/integration.go:296 @ 10/06/26 17:09:31.896&#xA;&lt; Exit [It] checks if the Snapshot is created - /tmp/tmp.jToXo61xWY/repo/e2e-tests/tests/integration-service/integration.go:296 @ 10/06/26 17:09:31.899 (3ms)&#xA;&gt; Enter [AfterEach] [integration-service-suite Integration Service E2E tests] - /tmp/tmp.jToXo61xWY/repo/e2e-tests/tests/integration-service/integration.go:49 @ 10/06/26 17:09:31.899&#xA;&lt; Exit [AfterEach] [integration-service-suite Integration Service E2E tests] - /tmp/tmp.jToXo61xWY/repo/e2e-tests/tests/integration-service/integration.go:49 @ 10/06/26 17:09:31.899 (0s)&#xA;</system-err>
          </testcase>
          <testcase name="[It] [integration-service-suite Integration Service E2E tests] with an integration test fail checks if the Build PipelineRun got annotated with Snapshot name [integration-service]" classname="Red Hat App Studio E2E tests" status="passed" time="0.007649482">
              <system-err>&gt; Enter [It] checks if the Build PipelineRun got annotated with Snapshot name - /tmp/tmp.jToXo61xWY/repo/e2e-tests/tests/integration-service/integration.go:301 @ 10/06/26 17:09:31.899&#xA;&lt; Exit [It] checks if the Build PipelineRun got annotated with Snapshot name - /tmp/tmp.jToXo61xWY/repo/e2e-tests/tests/integration-service/integration.go:301 @ 10/06/26 17:09:31.907 (8ms)&#xA;&gt; Enter [AfterEach] [integration-service-suite Integration Service E2E tests] - /tmp/tmp.jToXo61xWY/repo/e2e-tests/tests/integration-service/integration.go:49 @ 10/06/26 17:09:31.907&#xA;&lt; Exit [AfterEach] [integration-service-suite Integration Service E2E tests] - /tmp/tmp.jToXo61xWY/repo/e2e-tests/tests/integration-service/integration.go:49 @ 10/06/26 17:09:31.907 (0s)&#xA;</system-err>
          </testcase>
          <testcase name="[It] [integration-service-suite Integration Service E2E tests] with an integration test fail checks if all of the integrationPipelineRuns finished [integration-service, slow]" classname="Red Hat App Studio E2E tests" status="passed" time="0.004836589">
              <system-err>&gt; Enter [It] checks if all of the integrationPipelineRuns finished - /tmp/tmp.jToXo61xWY/repo/e2e-tests/tests/integration-service/integration.go:305 @ 10/06/26 17:09:31.907&#xA;Integration test scenario integration-test-sl1w is found&#xA;PipelineRun integration-test-sl1w-2mw97 reason: Succeeded&#xA;&lt; Exit [It] checks if all of the integrationPipelineRuns finished - /tmp/tmp.jToXo61xWY/repo/e2e-tests/tests/integration-service/integration.go:305 @ 10/06/26 17:09:31.911 (5ms)&#xA;&gt; Enter [AfterEach] [integration-service-suite Integration Service E2E tests] - /tmp/tmp.jToXo61xWY/repo/e2e-tests/tests/integration-service/integration.go:49 @ 10/06/26 17:09:31.912&#xA;&lt; Exit [AfterEach] [integration-service-suite Integration Service E2E tests] - /tmp/tmp.jToXo61xWY/repo/e2e-tests/tests/integration-service/integration.go:49 @ 10/06/26 17:09:31.912 (0s)&#xA;</system-err>
          </testcase>
          <testcase name="[It] [integration-service-suite Integration Service E2E tests] with an integration test fail checks if the failed status of integration test is reported in the Snapshot [integration-service]" classname="Red Hat App Studio E2E tests" status="passed" time="0.003162941">
              <system-err>&gt; Enter [It] checks if the failed status of integration test is reported in the Snapshot - /tmp/tmp.jToXo61xWY/repo/e2e-tests/tests/integration-service/integration.go:309 @ 10/06/26 17:09:31.912&#xA;&lt; Exit [It] checks if the failed status of integration test is reported in the Snapshot - /tmp/tmp.jToXo61xWY/repo/e2e-tests/tests/integration-service/integration.go:309 @ 10/06/26 17:09:31.915 (3ms)&#xA;&gt; Enter [AfterEach] [integration-service-suite Integration Service E2E tests] - /tmp/tmp.jToXo61xWY/repo/e2e-tests/tests/integration-service/integration.go:49 @ 10/06/26 17:09:31.915&#xA;&lt; Exit [AfterEach] [integration-service-suite Integration Service E2E tests] - /tmp/tmp.jToXo61xWY/repo/e2e-tests/tests/integration-service/integration.go:49 @ 10/06/26 17:09:31.915 (0s)&#xA;</system-err>
          </testcase>
          <testcase name="[It] [integration-service-suite Integration Service E2E tests] with an integration test fail checks if the skipped integration test is absent from the Snapshot&#39;s status annotation [integration-service]" classname="Red Hat App Studio E2E tests" status="passed" time="0.00312899">
              <system-err>&gt; Enter [It] checks if the skipped integration test is absent from the Snapshot&#39;s status annotation - /tmp/tmp.jToXo61xWY/repo/e2e-tests/tests/integration-service/integration.go:324 @ 10/06/26 17:09:31.915&#xA;&lt; Exit [It] checks if the skipped integration test is absent from the Snapshot&#39;s status annotation - /tmp/tmp.jToXo61xWY/repo/e2e-tests/tests/integration-service/integration.go:324 @ 10/06/26 17:09:31.918 (3ms)&#xA;&gt; Enter [AfterEach] [integration-service-suite Integration Service E2E tests] - /tmp/tmp.jToXo61xWY/repo/e2e-tests/tests/integration-service/integration.go:49 @ 10/06/26 17:09:31.918&#xA;&lt; Exit [AfterEach] [integration-service-suite Integration Service E2E tests] - /tmp/tmp.jToXo61xWY/repo/e2e-tests/tests/integration-service/integration.go:49 @ 10/06/26 17:09:31.918 (0s)&#xA;</system-err>
          </testcase>
          <testcase name="[It] [integration-service-suite Integration Service E2E tests] with an integration test fail checks if snapshot is marked as failed [integration-service]" classname="Red Hat App Studio E2E tests" status="passed" time="0.002962256">
              <system-err>&gt; Enter [It] checks if snapshot is marked as failed - /tmp/tmp.jToXo61xWY/repo/e2e-tests/tests/integration-service/integration.go:334 @ 10/06/26 17:09:31.918&#xA;&lt; Exit [It] checks if snapshot is marked as failed - /tmp/tmp.jToXo61xWY/repo/e2e-tests/tests/integration-service/integration.go:334 @ 10/06/26 17:09:31.921 (3ms)&#xA;&gt; Enter [AfterEach] [integration-service-suite Integration Service E2E tests] - /tmp/tmp.jToXo61xWY/repo/e2e-tests/tests/integration-service/integration.go:49 @ 10/06/26 17:09:31.921&#xA;&lt; Exit [AfterEach] [integration-service-suite Integration Service E2E tests] - /tmp/tmp.jToXo61xWY/repo/e2e-tests/tests/integration-service/integration.go:49 @ 10/06/26 17:09:31.921 (0s)&#xA;</system-err>
          </testcase>
          <testcase name="[It] [integration-service-suite Integration Service E2E tests] with an integration test fail checks if the finalizer was removed from all of the related Integration pipelineRuns [integration-service]" classname="Red Hat App Studio E2E tests" status="passed" time="0.005067753">
              <system-err>&gt; Enter [It] checks if the finalizer was removed from all of the related Integration pipelineRuns - /tmp/tmp.jToXo61xWY/repo/e2e-tests/tests/integration-service/integration.go:340 @ 10/06/26 17:09:31.921&#xA;Integration test scenario integration-test-sl1w is found&#xA;&lt; Exit [It] checks if the finalizer was removed from all of the related Integration pipelineRuns - /tmp/tmp.jToXo61xWY/repo/e2e-tests/tests/integration-service/integration.go:340 @ 10/06/26 17:09:31.926 (5ms)&#xA;&gt; Enter [AfterEach] [integration-service-suite Integration Service E2E tests] - /tmp/tmp.jToXo61xWY/repo/e2e-tests/tests/integration-service/integration.go:49 @ 10/06/26 17:09:31.926&#xA;&lt; Exit [AfterEach] [integration-service-suite Integration Service E2E tests] - /tmp/tmp.jToXo61xWY/repo/e2e-tests/tests/integration-service/integration.go:49 @ 10/06/26 17:09:31.926 (0s)&#xA;</system-err>
          </testcase>
          <testcase name="[It] [integration-service-suite Integration Service E2E tests] with an integration test fail creates a new IntegrationTestScenario [integration-service]" classname="Red Hat App Studio E2E tests" status="passed" time="0.094094188">
              <system-err>&gt; Enter [It] creates a new IntegrationTestScenario - /tmp/tmp.jToXo61xWY/repo/e2e-tests/tests/integration-service/integration.go:344 @ 10/06/26 17:09:31.926&#xA;&lt; Exit [It] creates a new IntegrationTestScenario - /tmp/tmp.jToXo61xWY/repo/e2e-tests/tests/integration-service/integration.go:344 @ 10/06/26 17:09:32.02 (94ms)&#xA;&gt; Enter [AfterEach] [integration-service-suite Integration Service E2E tests] - /tmp/tmp.jToXo61xWY/repo/e2e-tests/tests/integration-service/integration.go:49 @ 10/06/26 17:09:32.02&#xA;&lt; Exit [AfterEach] [integration-service-suite Integration Service E2E tests] - /tmp/tmp.jToXo61xWY/repo/e2e-tests/tests/integration-service/integration.go:49 @ 10/06/26 17:09:32.02 (0s)&#xA;</system-err>
          </testcase>
          <testcase name="[It] [integration-service-suite Integration Service E2E tests] with an integration test fail updates the Snapshot with the re-run label for the new scenario [integration-service]" classname="Red Hat App Studio E2E tests" status="passed" time="0.10087571">
              <system-err>&gt; Enter [It] updates the Snapshot with the re-run label for the new scenario - /tmp/tmp.jToXo61xWY/repo/e2e-tests/tests/integration-service/integration.go:349 @ 10/06/26 17:09:32.02&#xA;&lt; Exit [It] updates the Snapshot with the re-run label for the new scenario - /tmp/tmp.jToXo61xWY/repo/e2e-tests/tests/integration-service/integration.go:349 @ 10/06/26 17:09:32.121 (101ms)&#xA;&gt; Enter [AfterEach] [integration-service-suite Integration Service E2E tests] - /tmp/tmp.jToXo61xWY/repo/e2e-tests/tests/integration-service/integration.go:49 @ 10/06/26 17:09:32.121&#xA;&lt; Exit [AfterEach] [integration-service-suite Integration Service E2E tests] - /tmp/tmp.jToXo61xWY/repo/e2e-tests/tests/integration-service/integration.go:49 @ 10/06/26 17:09:32.121 (0s)&#xA;</system-err>
          </testcase>
          <testcase name="[It] [integration-service-suite Integration Service E2E tests] with an integration test fail when An snapshot is updated with a re-run label for a given scenario checks if the new integration pipelineRun started [integration-service, slow]" classname="Red Hat App Studio E2E tests" status="passed" time="20.01080535">
              <system-err>&gt; Enter [It] checks if the new integration pipelineRun started - /tmp/tmp.jToXo61xWY/repo/e2e-tests/tests/integration-service/integration.go:358 @ 10/06/26 17:09:32.121&#xA;PipelineRun has not been created yet for test scenario %s and snapshot %s/%s integration-test-70dg integration2-vdpf integ-app-86ic-20261006-170555-000&#xA;&lt; Exit [It] checks if the new integration pipelineRun started - /tmp/tmp.jToXo61xWY/repo/e2e-tests/tests/integration-service/integration.go:358 @ 10/06/26 17:09:52.132 (20.011s)&#xA;&gt; Enter [AfterEach] [integration-service-suite Integration Service E2E tests] - /tmp/tmp.jToXo61xWY/repo/e2e-tests/tests/integration-service/integration.go:49 @ 10/06/26 17:09:52.132&#xA;&lt; Exit [AfterEach] [integration-service-suite Integration Service E2E tests] - /tmp/tmp.jToXo61xWY/repo/e2e-tests/tests/integration-service/integration.go:49 @ 10/06/26 17:09:52.132 (0s)&#xA;</system-err>
          </testcase>
          <testcase name="[It] [integration-service-suite Integration Service E2E tests] with an integration test fail when An snapshot is updated with a re-run label for a given scenario checks if the re-run label was removed from the Snapshot [integration-service]" classname="Red Hat App Studio E2E tests" status="passed" time="0.003210652">
              <system-err>&gt; Enter [It] checks if the re-run label was removed from the Snapshot - /tmp/tmp.jToXo61xWY/repo/e2e-tests/tests/integration-service/integration.go:364 @ 10/06/26 17:09:52.132&#xA;&lt; Exit [It] checks if the re-run label was removed from the Snapshot - /tmp/tmp.jToXo61xWY/repo/e2e-tests/tests/integration-service/integration.go:364 @ 10/06/26 17:09:52.135 (3ms)&#xA;&gt; Enter [AfterEach] [integration-service-suite Integration Service E2E tests] - /tmp/tmp.jToXo61xWY/repo/e2e-tests/tests/integration-service/integration.go:49 @ 10/06/26 17:09:52.135&#xA;&lt; Exit [AfterEach] [integration-service-suite Integration Service E2E tests] - /tmp/tmp.jToXo61xWY/repo/e2e-tests/tests/integration-service/integration.go:49 @ 10/06/26 17:09:52.135 (0s)&#xA;</system-err>
          </testcase>
          <testcase name="[It] [integration-service-suite Integration Service E2E tests] with an integration test fail when An snapshot is updated with a re-run label for a given scenario checks if all integration pipelineRuns finished successfully [integration-service, slow]" classname="Red Hat App Studio E2E tests" status="passed" time="0.008434839">
              <system-err>&gt; Enter [It] checks if all integration pipelineRuns finished successfully - /tmp/tmp.jToXo61xWY/repo/e2e-tests/tests/integration-service/integration.go:378 @ 10/06/26 17:09:52.135&#xA;Integration test scenario integration-test-70dg is found&#xA;PipelineRun integration-test-70dg-9m4nf reason: Succeeded&#xA;Integration test scenario integration-test-sl1w is found&#xA;PipelineRun integration-test-sl1w-2mw97 reason: Succeeded&#xA;&lt; Exit [It] checks if all integration pipelineRuns finished successfully - /tmp/tmp.jToXo61xWY/repo/e2e-tests/tests/integration-service/integration.go:378 @ 10/06/26 17:09:52.143 (8ms)&#xA;&gt; Enter [AfterEach] [integration-service-suite Integration Service E2E tests] - /tmp/tmp.jToXo61xWY/repo/e2e-tests/tests/integration-service/integration.go:49 @ 10/06/26 17:09:52.144&#xA;&lt; Exit [AfterEach] [integration-service-suite Integration Service E2E tests] - /tmp/tmp.jToXo61xWY/repo/e2e-tests/tests/integration-service/integration.go:49 @ 10/06/26 17:09:52.144 (0s)&#xA;</system-err>
          </testcase>
          <testcase name="[It] [integration-service-suite Integration Service E2E tests] with an integration test fail when An snapshot is updated with a re-run label for a given scenario checks if the name of the re-triggered pipelinerun is reported in the Snapshot [integration-service]" classname="Red Hat App Studio E2E tests" status="passed" time="0.00577208">
              <system-err>&gt; Enter [It] checks if the name of the re-triggered pipelinerun is reported in the Snapshot - /tmp/tmp.jToXo61xWY/repo/e2e-tests/tests/integration-service/integration.go:382 @ 10/06/26 17:09:52.144&#xA;&lt; Exit [It] checks if the name of the re-triggered pipelinerun is reported in the Snapshot - /tmp/tmp.jToXo61xWY/repo/e2e-tests/tests/integration-service/integration.go:382 @ 10/06/26 17:09:52.15 (6ms)&#xA;&gt; Enter [AfterEach] [integration-service-suite Integration Service E2E tests] - /tmp/tmp.jToXo61xWY/repo/e2e-tests/tests/integration-service/integration.go:49 @ 10/06/26 17:09:52.15&#xA;&lt; Exit [AfterEach] [integration-service-suite Integration Service E2E tests] - /tmp/tmp.jToXo61xWY/repo/e2e-tests/tests/integration-service/integration.go:49 @ 10/06/26 17:09:52.15 (0s)&#xA;</system-err>
          </testcase>
          <testcase name="[It] [integration-service-suite Integration Service E2E tests] with an integration test fail when An snapshot is updated with a re-run label for a given scenario checks if snapshot is still marked as failed [integration-service]" classname="Red Hat App Studio E2E tests" status="passed" time="0.002512487">
              <system-err>&gt; Enter [It] checks if snapshot is still marked as failed - /tmp/tmp.jToXo61xWY/repo/e2e-tests/tests/integration-service/integration.go:399 @ 10/06/26 17:09:52.15&#xA;&lt; Exit [It] checks if snapshot is still marked as failed - /tmp/tmp.jToXo61xWY/repo/e2e-tests/tests/integration-service/integration.go:399 @ 10/06/26 17:09:52.152 (2ms)&#xA;&gt; Enter [AfterEach] [integration-service-suite Integration Service E2E tests] - /tmp/tmp.jToXo61xWY/repo/e2e-tests/tests/integration-service/integration.go:49 @ 10/06/26 17:09:52.152&#xA;&lt; Exit [AfterEach] [integration-service-suite Integration Service E2E tests] - /tmp/tmp.jToXo61xWY/repo/e2e-tests/tests/integration-service/integration.go:49 @ 10/06/26 17:09:52.152 (0s)&#xA;</system-err>
          </testcase>
          <testcase name="[It] [integration-service-suite Integration Service E2E tests] with an integration test fail creates an snapshot of push event [integration-service]" classname="Red Hat App Studio E2E tests" status="passed" time="0.008011969">
              <system-err>&gt; Enter [It] creates an snapshot of push event - /tmp/tmp.jToXo61xWY/repo/e2e-tests/tests/integration-service/integration.go:406 @ 10/06/26 17:09:52.152&#xA;&lt; Exit [It] creates an snapshot of push event - /tmp/tmp.jToXo61xWY/repo/e2e-tests/tests/integration-service/integration.go:406 @ 10/06/26 17:09:52.16 (8ms)&#xA;&gt; Enter [AfterEach] [integration-service-suite Integration Service E2E tests] - /tmp/tmp.jToXo61xWY/repo/e2e-tests/tests/integration-service/integration.go:49 @ 10/06/26 17:09:52.16&#xA;&lt; Exit [AfterEach] [integration-service-suite Integration Service E2E tests] - /tmp/tmp.jToXo61xWY/repo/e2e-tests/tests/integration-service/integration.go:49 @ 10/06/26 17:09:52.16 (0s)&#xA;</system-err>
          </testcase>
          <testcase name="[It] [integration-service-suite Integration Service E2E tests] with an integration test fail when An snapshot of push event is created checks no Release CRs are created [integration-service]" classname="Red Hat App Studio E2E tests" status="passed" time="53.782223425">
              <system-err>&gt; Enter [It] checks no Release CRs are created - /tmp/tmp.jToXo61xWY/repo/e2e-tests/tests/integration-service/integration.go:413 @ 10/06/26 17:09:52.16&#xA;&lt; Exit [It] checks no Release CRs are created - /tmp/tmp.jToXo61xWY/repo/e2e-tests/tests/integration-service/integration.go:413 @ 10/06/26 17:09:52.162 (2ms)&#xA;&gt; Enter [AfterAll] with an integration test fail - /tmp/tmp.jToXo61xWY/repo/e2e-tests/tests/integration-service/integration.go:250 @ 10/06/26 17:09:52.162&#xA;&lt; Exit [AfterAll] with an integration test fail - /tmp/tmp.jToXo61xWY/repo/e2e-tests/tests/integration-service/integration.go:250 @ 10/06/26 17:10:45.942 (53.78s)&#xA;&gt; Enter [AfterEach] [integration-service-suite Integration Service E2E tests] - /tmp/tmp.jToXo61xWY/repo/e2e-tests/tests/integration-service/integration.go:49 @ 10/06/26 17:10:45.942&#xA;&lt; Exit [AfterEach] [integration-service-suite Integration Service E2E tests] - /tmp/tmp.jToXo61xWY/repo/e2e-tests/tests/integration-service/integration.go:49 @ 10/06/26 17:10:45.942 (0s)&#xA;</system-err>
          </testcase>
          <testcase name="[It] [integration-service-suite Status Reporting of Integration tests] with status reporting of Integration tests in CheckRuns when a new Component with specified custom branch is created does not contain an annotation with a Snapshot Name [integration-service, github-status-reporting, custom-branch]" classname="Red Hat App Studio E2E tests" status="passed" time="31.820863238">
              <system-err>&gt; Enter [BeforeAll] with status reporting of Integration tests in CheckRuns - /tmp/tmp.jToXo61xWY/repo/e2e-tests/tests/integration-service/status-reporting-to-pullrequest.go:45 @ 10/06/26 17:10:45.943&#xA;Build PipelineRun has not been created yet for the component stat-rep-uq5a/test-component-pac-3ri73h&#xA;&lt; Exit [BeforeAll] with status reporting of Integration tests in CheckRuns - /tmp/tmp.jToXo61xWY/repo/e2e-tests/tests/integration-service/status-reporting-to-pullrequest.go:45 @ 10/06/26 17:11:17.763 (31.821s)&#xA;&gt; Enter [It] does not contain an annotation with a Snapshot Name - /tmp/tmp.jToXo61xWY/repo/e2e-tests/tests/integration-service/status-reporting-to-pullrequest.go:109 @ 10/06/26 17:11:17.763&#xA;&lt; Exit [It] does not contain an annotation with a Snapshot Name - /tmp/tmp.jToXo61xWY/repo/e2e-tests/tests/integration-service/status-reporting-to-pullrequest.go:109 @ 10/06/26 17:11:17.763 (0s)&#xA;&gt; Enter [AfterEach] [integration-service-suite Status Reporting of Integration tests] - /tmp/tmp.jToXo61xWY/repo/e2e-tests/tests/integration-service/status-reporting-to-pullrequest.go:42 @ 10/06/26 17:11:17.764&#xA;&lt; Exit [AfterEach] [integration-service-suite Status Reporting of Integration tests] - /tmp/tmp.jToXo61xWY/repo/e2e-tests/tests/integration-service/status-reporting-to-pullrequest.go:42 @ 10/06/26 17:11:17.764 (0s)&#xA;</system-err>
          </testcase>
          <testcase name="[It] [integration-service-suite Status Reporting of Integration tests] with status reporting of Integration tests in CheckRuns when a new Component with specified custom branch is created should have a related PaC init PR created [integration-service, github-status-reporting, custom-branch]" classname="Red Hat App Studio E2E tests" status="passed" time="0.289033895">
              <system-err>&gt; Enter [It] should have a related PaC init PR created - /tmp/tmp.jToXo61xWY/repo/e2e-tests/tests/integration-service/status-reporting-to-pullrequest.go:113 @ 10/06/26 17:11:17.764&#xA;&lt; Exit [It] should have a related PaC init PR created - /tmp/tmp.jToXo61xWY/repo/e2e-tests/tests/integration-service/status-reporting-to-pullrequest.go:113 @ 10/06/26 17:11:18.053 (289ms)&#xA;&gt; Enter [AfterEach] [integration-service-suite Status Reporting of Integration tests] - /tmp/tmp.jToXo61xWY/repo/e2e-tests/tests/integration-service/status-reporting-to-pullrequest.go:42 @ 10/06/26 17:11:18.053&#xA;&lt; Exit [AfterEach] [integration-service-suite Status Reporting of Integration tests] - /tmp/tmp.jToXo61xWY/repo/e2e-tests/tests/integration-service/status-reporting-to-pullrequest.go:42 @ 10/06/26 17:11:18.053 (0s)&#xA;</system-err>
          </testcase>
          <testcase name="[It] [integration-service-suite Status Reporting of Integration tests] with status reporting of Integration tests in CheckRuns when a new Component with specified custom branch is created initialized integration test status is reported to github [integration-service, github-status-reporting, custom-branch]" classname="Red Hat App Studio E2E tests" status="passed" time="0.329114015">
              <system-err>&gt; Enter [It] initialized integration test status is reported to github - /tmp/tmp.jToXo61xWY/repo/e2e-tests/tests/integration-service/status-reporting-to-pullrequest.go:132 @ 10/06/26 17:11:18.053&#xA;&lt; Exit [It] initialized integration test status is reported to github - /tmp/tmp.jToXo61xWY/repo/e2e-tests/tests/integration-service/status-reporting-to-pullrequest.go:132 @ 10/06/26 17:11:18.382 (329ms)&#xA;&gt; Enter [AfterEach] [integration-service-suite Status Reporting of Integration tests] - /tmp/tmp.jToXo61xWY/repo/e2e-tests/tests/integration-service/status-reporting-to-pullrequest.go:42 @ 10/06/26 17:11:18.382&#xA;&lt; Exit [AfterEach] [integration-service-suite Status Reporting of Integration tests] - /tmp/tmp.jToXo61xWY/repo/e2e-tests/tests/integration-service/status-reporting-to-pullrequest.go:42 @ 10/06/26 17:11:18.382 (0s)&#xA;</system-err>
          </testcase>
          <testcase name="[It] [integration-service-suite Status Reporting of Integration tests] with status reporting of Integration tests in CheckRuns when a new Component with specified custom branch is created should lead to build PipelineRun finishing successfully [integration-service, github-status-reporting, custom-branch]" classname="Red Hat App Studio E2E tests" status="passed" time="200.254817402">
              <system-err>&gt; Enter [It] should lead to build PipelineRun finishing successfully - /tmp/tmp.jToXo61xWY/repo/e2e-tests/tests/integration-service/status-reporting-to-pullrequest.go:142 @ 10/06/26 17:11:18.382&#xA;PipelineRun test-component-pac-3ri73h-on-pull-request-vkppj reason: Running&#xA;PipelineRun test-component-pac-3ri73h-on-pull-request-vkppj reason: Running&#xA;PipelineRun test-component-pac-3ri73h-on-pull-request-vkppj reason: Running&#xA;PipelineRun test-component-pac-3ri73h-on-pull-request-vkppj reason: Running&#xA;PipelineRun test-component-pac-3ri73h-on-pull-request-vkppj reason: Running&#xA;PipelineRun test-component-pac-3ri73h-on-pull-request-vkppj reason: Running&#xA;PipelineRun test-component-pac-3ri73h-on-pull-request-vkppj reason: Running&#xA;PipelineRun test-component-pac-3ri73h-on-pull-request-vkppj reason: Running&#xA;PipelineRun test-component-pac-3ri73h-on-pull-request-vkppj reason: Running&#xA;PipelineRun test-component-pac-3ri73h-on-pull-request-vkppj reason: Running&#xA;PipelineRun test-component-pac-3ri73h-on-pull-request-vkppj reason: Completed&#xA;&lt; Exit [It] should lead to build PipelineRun finishing successfully - /tmp/tmp.jToXo61xWY/repo/e2e-tests/tests/integration-service/status-reporting-to-pullrequest.go:142 @ 10/06/26 17:14:38.637 (3m20.255s)&#xA;&gt; Enter [AfterEach] [integration-service-suite Status Reporting of Integration tests] - /tmp/tmp.jToXo61xWY/repo/e2e-tests/tests/integration-service/status-reporting-to-pullrequest.go:42 @ 10/06/26 17:14:38.637&#xA;&lt; Exit [AfterEach] [integration-service-suite Status Reporting of Integration tests] - /tmp/tmp.jToXo61xWY/repo/e2e-tests/tests/integration-service/status-reporting-to-pullrequest.go:42 @ 10/06/26 17:14:38.637 (0s)&#xA;</system-err>
          </testcase>
          <testcase name="[It] [integration-service-suite Status Reporting of Integration tests] with status reporting of Integration tests in CheckRuns when the PaC build pipelineRun run succeeded checks if the BuildPipelineRun have the annotation of chains signed [integration-service, github-status-reporting]" classname="Red Hat App Studio E2E tests" status="passed" time="0.108082629">
              <system-err>&gt; Enter [It] checks if the BuildPipelineRun have the annotation of chains signed - /tmp/tmp.jToXo61xWY/repo/e2e-tests/tests/integration-service/status-reporting-to-pullrequest.go:149 @ 10/06/26 17:14:38.637&#xA;&lt; Exit [It] checks if the BuildPipelineRun have the annotation of chains signed - /tmp/tmp.jToXo61xWY/repo/e2e-tests/tests/integration-service/status-reporting-to-pullrequest.go:149 @ 10/06/26 17:14:38.745 (108ms)&#xA;&gt; Enter [AfterEach] [integration-service-suite Status Reporting of Integration tests] - /tmp/tmp.jToXo61xWY/repo/e2e-tests/tests/integration-service/status-reporting-to-pullrequest.go:42 @ 10/06/26 17:14:38.745&#xA;&lt; Exit [AfterEach] [integration-service-suite Status Reporting of Integration tests] - /tmp/tmp.jToXo61xWY/repo/e2e-tests/tests/integration-service/status-reporting-to-pullrequest.go:42 @ 10/06/26 17:14:38.745 (0s)&#xA;</system-err>
          </testcase>
          <testcase name="[It] [integration-service-suite Status Reporting of Integration tests] with status reporting of Integration tests in CheckRuns when the PaC build pipelineRun run succeeded checks if the Snapshot is created [integration-service, github-status-reporting]" classname="Red Hat App Studio E2E tests" status="passed" time="0.002991367">
              <system-err>&gt; Enter [It] checks if the Snapshot is created - /tmp/tmp.jToXo61xWY/repo/e2e-tests/tests/integration-service/status-reporting-to-pullrequest.go:153 @ 10/06/26 17:14:38.745&#xA;&lt; Exit [It] checks if the Snapshot is created - /tmp/tmp.jToXo61xWY/repo/e2e-tests/tests/integration-service/status-reporting-to-pullrequest.go:153 @ 10/06/26 17:14:38.748 (3ms)&#xA;&gt; Enter [AfterEach] [integration-service-suite Status Reporting of Integration tests] - /tmp/tmp.jToXo61xWY/repo/e2e-tests/tests/integration-service/status-reporting-to-pullrequest.go:42 @ 10/06/26 17:14:38.748&#xA;&lt; Exit [AfterEach] [integration-service-suite Status Reporting of Integration tests] - /tmp/tmp.jToXo61xWY/repo/e2e-tests/tests/integration-service/status-reporting-to-pullrequest.go:42 @ 10/06/26 17:14:38.748 (0s)&#xA;</system-err>
          </testcase>
          <testcase name="[It] [integration-service-suite Status Reporting of Integration tests] with status reporting of Integration tests in CheckRuns when the PaC build pipelineRun run succeeded checks if the Build PipelineRun got annotated with Snapshot name [integration-service, github-status-reporting]" classname="Red Hat App Studio E2E tests" status="passed" time="0.007903466">
              <system-err>&gt; Enter [It] checks if the Build PipelineRun got annotated with Snapshot name - /tmp/tmp.jToXo61xWY/repo/e2e-tests/tests/integration-service/status-reporting-to-pullrequest.go:158 @ 10/06/26 17:14:38.748&#xA;&lt; Exit [It] checks if the Build PipelineRun got annotated with Snapshot name - /tmp/tmp.jToXo61xWY/repo/e2e-tests/tests/integration-service/status-reporting-to-pullrequest.go:158 @ 10/06/26 17:14:38.756 (8ms)&#xA;&gt; Enter [AfterEach] [integration-service-suite Status Reporting of Integration tests] - /tmp/tmp.jToXo61xWY/repo/e2e-tests/tests/integration-service/status-reporting-to-pullrequest.go:42 @ 10/06/26 17:14:38.756&#xA;&lt; Exit [AfterEach] [integration-service-suite Status Reporting of Integration tests] - /tmp/tmp.jToXo61xWY/repo/e2e-tests/tests/integration-service/status-reporting-to-pullrequest.go:42 @ 10/06/26 17:14:38.756 (0s)&#xA;</system-err>
          </testcase>
          <testcase name="[It] [integration-service-suite Status Reporting of Integration tests] with status reporting of Integration tests in CheckRuns when the Snapshot was created should find both the related Integration PipelineRuns [integration-service, github-status-reporting]" classname="Red Hat App Studio E2E tests" status="passed" time="0.082397155">
              <system-err>&gt; Enter [It] should find both the related Integration PipelineRuns - /tmp/tmp.jToXo61xWY/repo/e2e-tests/tests/integration-service/status-reporting-to-pullrequest.go:164 @ 10/06/26 17:14:38.756&#xA;&lt; Exit [It] should find both the related Integration PipelineRuns - /tmp/tmp.jToXo61xWY/repo/e2e-tests/tests/integration-service/status-reporting-to-pullrequest.go:164 @ 10/06/26 17:14:38.838 (82ms)&#xA;&gt; Enter [AfterEach] [integration-service-suite Status Reporting of Integration tests] - /tmp/tmp.jToXo61xWY/repo/e2e-tests/tests/integration-service/status-reporting-to-pullrequest.go:42 @ 10/06/26 17:14:38.838&#xA;&lt; Exit [AfterEach] [integration-service-suite Status Reporting of Integration tests] - /tmp/tmp.jToXo61xWY/repo/e2e-tests/tests/integration-service/status-reporting-to-pullrequest.go:42 @ 10/06/26 17:14:38.838 (0s)&#xA;</system-err>
          </testcase>
          <testcase name="[It] [integration-service-suite Status Reporting of Integration tests] with status reporting of Integration tests in CheckRuns when Integration PipelineRuns are created should eventually complete successfully [integration-service, github-status-reporting]" classname="Red Hat App Studio E2E tests" status="passed" time="20.01589967">
              <system-err>&gt; Enter [It] should eventually complete successfully - /tmp/tmp.jToXo61xWY/repo/e2e-tests/tests/integration-service/status-reporting-to-pullrequest.go:183 @ 10/06/26 17:14:38.838&#xA;PipelineRun integration-test-3nxh-fbbgl reason: Running&#xA;PipelineRun integration-test-3nxh-fbbgl reason: Succeeded&#xA;PipelineRun integration-test-79tm-6d9rq reason: Succeeded&#xA;PipelineRun integration-test-4vdd-hdp78 reason: Succeeded&#xA;&lt; Exit [It] should eventually complete successfully - /tmp/tmp.jToXo61xWY/repo/e2e-tests/tests/integration-service/status-reporting-to-pullrequest.go:183 @ 10/06/26 17:14:58.854 (20.016s)&#xA;&gt; Enter [AfterEach] [integration-service-suite Status Reporting of Integration tests] - /tmp/tmp.jToXo61xWY/repo/e2e-tests/tests/integration-service/status-reporting-to-pullrequest.go:42 @ 10/06/26 17:14:58.854&#xA;&lt; Exit [AfterEach] [integration-service-suite Status Reporting of Integration tests] - /tmp/tmp.jToXo61xWY/repo/e2e-tests/tests/integration-service/status-reporting-to-pullrequest.go:42 @ 10/06/26 17:14:58.854 (0s)&#xA;</system-err>
          </testcase>
          <testcase name="[It] [integration-service-suite Status Reporting of Integration tests] with status reporting of Integration tests in CheckRuns when Integration PipelineRuns completes successfully should lead to Snapshot CR being marked as failed [integration-service, github-status-reporting]" classname="Red Hat App Studio E2E tests" status="passed" time="0.011034487">
              <system-err>&gt; Enter [It] should lead to Snapshot CR being marked as failed - /tmp/tmp.jToXo61xWY/repo/e2e-tests/tests/integration-service/status-reporting-to-pullrequest.go:191 @ 10/06/26 17:14:58.854&#xA;&lt; Exit [It] should lead to Snapshot CR being marked as failed - /tmp/tmp.jToXo61xWY/repo/e2e-tests/tests/integration-service/status-reporting-to-pullrequest.go:191 @ 10/06/26 17:14:58.865 (11ms)&#xA;&gt; Enter [AfterEach] [integration-service-suite Status Reporting of Integration tests] - /tmp/tmp.jToXo61xWY/repo/e2e-tests/tests/integration-service/status-reporting-to-pullrequest.go:42 @ 10/06/26 17:14:58.865&#xA;&lt; Exit [AfterEach] [integration-service-suite Status Reporting of Integration tests] - /tmp/tmp.jToXo61xWY/repo/e2e-tests/tests/integration-service/status-reporting-to-pullrequest.go:42 @ 10/06/26 17:14:58.865 (0s)&#xA;</system-err>
          </testcase>
          <testcase name="[It] [integration-service-suite Status Reporting of Integration tests] with status reporting of Integration tests in CheckRuns when Integration PipelineRuns completes successfully eventually leads to the status reported at Checks tab for the successful Integration PipelineRun [integration-service, github-status-reporting]" classname="Red Hat App Studio E2E tests" status="passed" time="0.523500165">
              <system-err>&gt; Enter [It] eventually leads to the status reported at Checks tab for the successful Integration PipelineRun - /tmp/tmp.jToXo61xWY/repo/e2e-tests/tests/integration-service/status-reporting-to-pullrequest.go:205 @ 10/06/26 17:14:58.865&#xA;&lt; Exit [It] eventually leads to the status reported at Checks tab for the successful Integration PipelineRun - /tmp/tmp.jToXo61xWY/repo/e2e-tests/tests/integration-service/status-reporting-to-pullrequest.go:205 @ 10/06/26 17:14:59.389 (523ms)&#xA;&gt; Enter [AfterEach] [integration-service-suite Status Reporting of Integration tests] - /tmp/tmp.jToXo61xWY/repo/e2e-tests/tests/integration-service/status-reporting-to-pullrequest.go:42 @ 10/06/26 17:14:59.389&#xA;&lt; Exit [AfterEach] [integration-service-suite Status Reporting of Integration tests] - /tmp/tmp.jToXo61xWY/repo/e2e-tests/tests/integration-service/status-reporting-to-pullrequest.go:42 @ 10/06/26 17:14:59.389 (0s)&#xA;</system-err>
          </testcase>
          <testcase name="[It] [integration-service-suite Status Reporting of Integration tests] with status reporting of Integration tests in CheckRuns when Integration PipelineRuns completes successfully eventually leads to the status reported at Checks tab for the failed Integration PipelineRun [integration-service, github-status-reporting]" classname="Red Hat App Studio E2E tests" status="passed" time="0.500314246">
              <system-err>&gt; Enter [It] eventually leads to the status reported at Checks tab for the failed Integration PipelineRun - /tmp/tmp.jToXo61xWY/repo/e2e-tests/tests/integration-service/status-reporting-to-pullrequest.go:209 @ 10/06/26 17:14:59.389&#xA;&lt; Exit [It] eventually leads to the status reported at Checks tab for the failed Integration PipelineRun - /tmp/tmp.jToXo61xWY/repo/e2e-tests/tests/integration-service/status-reporting-to-pullrequest.go:209 @ 10/06/26 17:14:59.889 (500ms)&#xA;&gt; Enter [AfterEach] [integration-service-suite Status Reporting of Integration tests] - /tmp/tmp.jToXo61xWY/repo/e2e-tests/tests/integration-service/status-reporting-to-pullrequest.go:42 @ 10/06/26 17:14:59.889&#xA;&lt; Exit [AfterEach] [integration-service-suite Status Reporting of Integration tests] - /tmp/tmp.jToXo61xWY/repo/e2e-tests/tests/integration-service/status-reporting-to-pullrequest.go:42 @ 10/06/26 17:14:59.889 (0s)&#xA;</system-err>
          </testcase>
          <testcase name="[It] [integration-service-suite Status Reporting of Integration tests] with status reporting of Integration tests in CheckRuns when Integration PipelineRuns completes successfully eventually leads to the status reported at Checks tab for the optional Integration PipelineRun [integration-service, github-status-reporting]" classname="Red Hat App Studio E2E tests" status="passed" time="0.48795682">
              <system-err>&gt; Enter [It] eventually leads to the status reported at Checks tab for the optional Integration PipelineRun - /tmp/tmp.jToXo61xWY/repo/e2e-tests/tests/integration-service/status-reporting-to-pullrequest.go:213 @ 10/06/26 17:14:59.889&#xA;&lt; Exit [It] eventually leads to the status reported at Checks tab for the optional Integration PipelineRun - /tmp/tmp.jToXo61xWY/repo/e2e-tests/tests/integration-service/status-reporting-to-pullrequest.go:213 @ 10/06/26 17:15:00.377 (488ms)&#xA;&gt; Enter [AfterEach] [integration-service-suite Status Reporting of Integration tests] - /tmp/tmp.jToXo61xWY/repo/e2e-tests/tests/integration-service/status-reporting-to-pullrequest.go:42 @ 10/06/26 17:15:00.377&#xA;&lt; Exit [AfterEach] [integration-service-suite Status Reporting of Integration tests] - /tmp/tmp.jToXo61xWY/repo/e2e-tests/tests/integration-service/status-reporting-to-pullrequest.go:42 @ 10/06/26 17:15:00.377 (0s)&#xA;</system-err>
          </testcase>
          <testcase name="[It] [integration-service-suite Status Reporting of Integration tests] with status reporting of Integration tests in CheckRuns when Integration PipelineRuns completes successfully checks if the optional Integration Test Scenario status is reported in the Snapshot [integration-service, github-status-reporting]" classname="Red Hat App Studio E2E tests" status="passed" time="0.004664554">
              <system-err>&gt; Enter [It] checks if the optional Integration Test Scenario status is reported in the Snapshot - /tmp/tmp.jToXo61xWY/repo/e2e-tests/tests/integration-service/status-reporting-to-pullrequest.go:217 @ 10/06/26 17:15:00.377&#xA;&lt; Exit [It] checks if the optional Integration Test Scenario status is reported in the Snapshot - /tmp/tmp.jToXo61xWY/repo/e2e-tests/tests/integration-service/status-reporting-to-pullrequest.go:217 @ 10/06/26 17:15:00.382 (5ms)&#xA;&gt; Enter [AfterEach] [integration-service-suite Status Reporting of Integration tests] - /tmp/tmp.jToXo61xWY/repo/e2e-tests/tests/integration-service/status-reporting-to-pullrequest.go:42 @ 10/06/26 17:15:00.382&#xA;&lt; Exit [AfterEach] [integration-service-suite Status Reporting of Integration tests] - /tmp/tmp.jToXo61xWY/repo/e2e-tests/tests/integration-service/status-reporting-to-pullrequest.go:42 @ 10/06/26 17:15:00.382 (0s)&#xA;</system-err>
          </testcase>
          <testcase name="[It] [integration-service-suite Status Reporting of Integration tests] with status reporting of Integration tests in CheckRuns when Integration PipelineRuns completes successfully checks if the finalizer was removed from the optional Integration PipelineRun [integration-service, github-status-reporting]" classname="Red Hat App Studio E2E tests" status="passed" time="0.003247673">
              <system-err>&gt; Enter [It] checks if the finalizer was removed from the optional Integration PipelineRun - /tmp/tmp.jToXo61xWY/repo/e2e-tests/tests/integration-service/status-reporting-to-pullrequest.go:232 @ 10/06/26 17:15:00.382&#xA;&lt; Exit [It] checks if the finalizer was removed from the optional Integration PipelineRun - /tmp/tmp.jToXo61xWY/repo/e2e-tests/tests/integration-service/status-reporting-to-pullrequest.go:232 @ 10/06/26 17:15:00.385 (3ms)&#xA;&gt; Enter [AfterEach] [integration-service-suite Status Reporting of Integration tests] - /tmp/tmp.jToXo61xWY/repo/e2e-tests/tests/integration-service/status-reporting-to-pullrequest.go:42 @ 10/06/26 17:15:00.385&#xA;&lt; Exit [AfterEach] [integration-service-suite Status Reporting of Integration tests] - /tmp/tmp.jToXo61xWY/repo/e2e-tests/tests/integration-service/status-reporting-to-pullrequest.go:42 @ 10/06/26 17:15:00.385 (0s)&#xA;</system-err>
          </testcase>
          <testcase name="[It] [integration-service-suite Status Reporting of Integration tests] with status reporting of Integration tests in CheckRuns when Integration PipelineRuns completes successfully merging the PR, expected to succeed  [integration-service, github-status-reporting]" classname="Red Hat App Studio E2E tests" status="passed" time="2.5993875429999997">
              <system-err>&gt; Enter [It] merging the PR, expected to succeed  - /tmp/tmp.jToXo61xWY/repo/e2e-tests/tests/integration-service/status-reporting-to-pullrequest.go:236 @ 10/06/26 17:15:00.385&#xA;merged result sha: 2b2aae83d209838cce1dac174fb1ac1ff06f1eac for PR #11629&#xA;&lt; Exit [It] merging the PR, expected to succeed  - /tmp/tmp.jToXo61xWY/repo/e2e-tests/tests/integration-service/status-reporting-to-pullrequest.go:236 @ 10/06/26 17:15:02.985 (2.599s)&#xA;&gt; Enter [AfterEach] [integration-service-suite Status Reporting of Integration tests] - /tmp/tmp.jToXo61xWY/repo/e2e-tests/tests/integration-service/status-reporting-to-pullrequest.go:42 @ 10/06/26 17:15:02.985&#xA;&lt; Exit [AfterEach] [integration-service-suite Status Reporting of Integration tests] - /tmp/tmp.jToXo61xWY/repo/e2e-tests/tests/integration-service/status-reporting-to-pullrequest.go:42 @ 10/06/26 17:15:02.985 (0s)&#xA;</system-err>
          </testcase>
          <testcase name="[It] [integration-service-suite Status Reporting of Integration tests] with status reporting of Integration tests in CheckRuns when Integration PipelineRuns completes successfully leads to triggering a push PipelineRun [integration-service, github-status-reporting]" classname="Red Hat App Studio E2E tests" status="passed" time="20.01578042">
              <system-err>&gt; Enter [It] leads to triggering a push PipelineRun - /tmp/tmp.jToXo61xWY/repo/e2e-tests/tests/integration-service/status-reporting-to-pullrequest.go:245 @ 10/06/26 17:15:02.985&#xA;Push PipelineRun has not been created yet for the component stat-rep-uq5a/test-component-pac-3ri73h&#xA;&lt; Exit [It] leads to triggering a push PipelineRun - /tmp/tmp.jToXo61xWY/repo/e2e-tests/tests/integration-service/status-reporting-to-pullrequest.go:245 @ 10/06/26 17:15:23.001 (20.016s)&#xA;&gt; Enter [AfterEach] [integration-service-suite Status Reporting of Integration tests] - /tmp/tmp.jToXo61xWY/repo/e2e-tests/tests/integration-service/status-reporting-to-pullrequest.go:42 @ 10/06/26 17:15:23.001&#xA;&lt; Exit [AfterEach] [integration-service-suite Status Reporting of Integration tests] - /tmp/tmp.jToXo61xWY/repo/e2e-tests/tests/integration-service/status-reporting-to-pullrequest.go:42 @ 10/06/26 17:15:23.001 (0s)&#xA;</system-err>
          </testcase>
          <testcase name="[It] [integration-service-suite Status Reporting of Integration tests] with status reporting of Integration tests in CheckRuns when Integration PipelineRuns completes successfully verifies that Push PipelineRuns completed [integration-service, github-status-reporting]" classname="Red Hat App Studio E2E tests" status="passed" time="0.0053534">
              <system-err>&gt; Enter [It] verifies that Push PipelineRuns completed - /tmp/tmp.jToXo61xWY/repo/e2e-tests/tests/integration-service/status-reporting-to-pullrequest.go:260 @ 10/06/26 17:15:23.001&#xA;PipelineRun integration-test-3nxh-fbbgl reason: Succeeded&#xA;PipelineRun integration-test-79tm-6d9rq reason: Succeeded&#xA;&lt; Exit [It] verifies that Push PipelineRuns completed - /tmp/tmp.jToXo61xWY/repo/e2e-tests/tests/integration-service/status-reporting-to-pullrequest.go:260 @ 10/06/26 17:15:23.006 (5ms)&#xA;&gt; Enter [AfterEach] [integration-service-suite Status Reporting of Integration tests] - /tmp/tmp.jToXo61xWY/repo/e2e-tests/tests/integration-service/status-reporting-to-pullrequest.go:42 @ 10/06/26 17:15:23.006&#xA;&lt; Exit [AfterEach] [integration-service-suite Status Reporting of Integration tests] - /tmp/tmp.jToXo61xWY/repo/e2e-tests/tests/integration-service/status-reporting-to-pullrequest.go:42 @ 10/06/26 17:15:23.006 (0s)&#xA;</system-err>
          </testcase>
          <testcase name="[It] [integration-service-suite Status Reporting of Integration tests] with status reporting of Integration tests in CheckRuns when Integration PipelineRuns completes successfully validates the Integration test scenario PipelineRun is reported to merge request CheckRuns, and it pass [integration-service, github-status-reporting]" classname="Red Hat App Studio E2E tests" status="passed" time="0.39527739">
              <system-err>&gt; Enter [It] validates the Integration test scenario PipelineRun is reported to merge request CheckRuns, and it pass - /tmp/tmp.jToXo61xWY/repo/e2e-tests/tests/integration-service/status-reporting-to-pullrequest.go:265 @ 10/06/26 17:15:23.006&#xA;&lt; Exit [It] validates the Integration test scenario PipelineRun is reported to merge request CheckRuns, and it pass - /tmp/tmp.jToXo61xWY/repo/e2e-tests/tests/integration-service/status-reporting-to-pullrequest.go:265 @ 10/06/26 17:15:23.401 (395ms)&#xA;&gt; Enter [AfterEach] [integration-service-suite Status Reporting of Integration tests] - /tmp/tmp.jToXo61xWY/repo/e2e-tests/tests/integration-service/status-reporting-to-pullrequest.go:42 @ 10/06/26 17:15:23.401&#xA;&lt; Exit [AfterEach] [integration-service-suite Status Reporting of Integration tests] - /tmp/tmp.jToXo61xWY/repo/e2e-tests/tests/integration-service/status-reporting-to-pullrequest.go:42 @ 10/06/26 17:15:23.401 (0s)&#xA;</system-err>
          </testcase>
          <testcase name="[It] [integration-service-suite Status Reporting of Integration tests] with status reporting of Integration tests in CheckRuns when Integration PipelineRuns completes successfully eventually leads to the status reported at Checks tab for the failed Integration PipelineRun [integration-service, github-status-reporting]" classname="Red Hat App Studio E2E tests" status="passed" time="0.499822167">
              <system-err>&gt; Enter [It] eventually leads to the status reported at Checks tab for the failed Integration PipelineRun - /tmp/tmp.jToXo61xWY/repo/e2e-tests/tests/integration-service/status-reporting-to-pullrequest.go:270 @ 10/06/26 17:15:23.401&#xA;&lt; Exit [It] eventually leads to the status reported at Checks tab for the failed Integration PipelineRun - /tmp/tmp.jToXo61xWY/repo/e2e-tests/tests/integration-service/status-reporting-to-pullrequest.go:270 @ 10/06/26 17:15:23.901 (500ms)&#xA;&gt; Enter [AfterEach] [integration-service-suite Status Reporting of Integration tests] - /tmp/tmp.jToXo61xWY/repo/e2e-tests/tests/integration-service/status-reporting-to-pullrequest.go:42 @ 10/06/26 17:15:23.901&#xA;&lt; Exit [AfterEach] [integration-service-suite Status Reporting of Integration tests] - /tmp/tmp.jToXo61xWY/repo/e2e-tests/tests/integration-service/status-reporting-to-pullrequest.go:42 @ 10/06/26 17:15:23.901 (0s)&#xA;</system-err>
          </testcase>
          <testcase name="[It] [integration-service-suite Status Reporting of Integration tests] with status reporting of Integration tests in CheckRuns when The git-provider annotation is missing should set the git-reporting-failure annotation correctly [integration-service, github-status-reporting]" classname="Red Hat App Studio E2E tests" status="passed" time="29.21631184">
              <system-err>&gt; Enter [It] should set the git-reporting-failure annotation correctly - /tmp/tmp.jToXo61xWY/repo/e2e-tests/tests/integration-service/status-reporting-to-pullrequest.go:276 @ 10/06/26 17:15:23.901&#xA;gitReportingFailureAnnotation does not exist. Annotations: map[build.appstudio.openshift.io/repo:https://github.com/redhat-appstudio-qe/konflux-test-integration-status-report?rev=9391c4de1527570f7af75a3a6316606877ce9f7c build.appstudio.redhat.com/commit_sha:9391c4de1527570f7af75a3a6316606877ce9f7c build.appstudio.redhat.com/pull_request_number:11629 build.appstudio.redhat.com/target_branch:base-yz1uvr pac.test.appstudio.openshift.io/branch:base-yz1uvr pac.test.appstudio.openshift.io/cancel-in-progress:true pac.test.appstudio.openshift.io/check-run-id:112399553209 pac.test.appstudio.openshift.io/controller-info:{&#34;name&#34;:&#34;default&#34;,&#34;configmap&#34;:&#34;pipelines-as-code&#34;,&#34;secret&#34;:&#34;pipelines-as-code-secret&#34;, &#34;gRepo&#34;: &#34;pipelines-as-code&#34;} pac.test.appstudio.openshift.io/event-type:pull_request pac.test.appstudio.openshift.io/git-auth-secret:pac-gitauth-byutih pac.test.appstudio.openshift.io/git-provider:not-supported-provider pac.test.appstudio.openshift.io/installation-id:72200095 pac.test.appstudio.openshift.io/log-url:https://dashboard.is.not.configured pac.test.appstudio.openshift.io/max-keep-runs:3 pac.test.appstudio.openshift.io/on-cel-expression:event == &#34;pull_request&#34; &amp;&amp; target_branch == &#34;base-yz1uvr&#34; pac.test.appstudio.openshift.io/original-prname:test-component-pac-3ri73h-on-pull-request pac.test.appstudio.openshift.io/pull-request:11629 pac.test.appstudio.openshift.io/repo-url:https://github.com/redhat-appstudio-qe/konflux-test-integration-status-report pac.test.appstudio.openshift.io/repository:github-com-redhat-appstudio-qe-konflux-test-integration-status-report pac.test.appstudio.openshift.io/scm-reporting-plr-started:true pac.test.appstudio.openshift.io/secret-created:true pac.test.appstudio.openshift.io/sender:konflux-ci-e2e-tests[bot] pac.test.appstudio.openshift.io/sha:9391c4de1527570f7af75a3a6316606877ce9f7c pac.test.appstudio.openshift.io/sha-title:konflux-ci e2e-tests update test-component-pac-3ri73h pac.test.appstudio.openshift.io/sha-url:https://github.com/redhat-appstudio-qe/konflux-test-integration-status-report/commit/9391c4de1527570f7af75a3a6316606877ce9f7c pac.test.appstudio.openshift.io/source-branch:konflux-test-component-pac-3ri73h pac.test.appstudio.openshift.io/source-repo-url:https://github.com/redhat-appstudio-qe/konflux-test-integration-status-report pac.test.appstudio.openshift.io/state:completed pac.test.appstudio.openshift.io/url-org:redhat-appstudio-qe pac.test.appstudio.openshift.io/url-repository:konflux-test-integration-status-report test.appstudio.openshift.io/create-groupsnapshot-status:The number 0 of component snapshots belonging to this pr group hash 4d19886fa77cd091865018c86a803bc7ff3b9c5ef090f246ec1278cc16e3b9 is less than 2, skipping group snapshot creation test.appstudio.openshift.io/git-reporter-status:{&#34;scenarios&#34;:{&#34;integration-test-3nxh-integ-app-5ypj-20261006-171100-000&#34;:{&#34;lastUpdateTime&#34;:&#34;2026-10-06T17:14:40.115168636Z&#34;},&#34;integration-test-4vdd-integ-app-5ypj-20261006-171100-000&#34;:{&#34;lastUpdateTime&#34;:&#34;2026-10-06T17:14:42.11543174Z&#34;},&#34;integration-test-79tm-integ-app-5ypj-20261006-171100-000&#34;:{&#34;lastUpdateTime&#34;:&#34;2026-10-06T17:14:40.615290494Z&#34;}}} test.appstudio.openshift.io/integration-workflow:pull-request test.appstudio.openshift.io/pipelinerunstarttime:1791306660000 test.appstudio.openshift.io/pr-group:konflux-test-component-pac-3ri73h test.appstudio.openshift.io/pr-status:merged test.appstudio.openshift.io/result-chains-git-commit:9391c4de1527570f7af75a3a6316606877ce9f7c test.appstudio.openshift.io/result-chains-git-url:https://github.com/redhat-appstudio-qe/konflux-test-integration-status-report test.appstudio.openshift.io/result-image-digest:sha256:0481ecf029789a31ab9905487b5aa22a00a7409cde4c02e232b51fbbc41abebc test.appstudio.openshift.io/result-image-url:quay.io/redhat-appstudio-qe/stat-rep-uq5a/test-component-pac-3ri73h:on-pr-9391c4de1527570f7af75a3a6316606877ce9f7c test.appstudio.openshift.io/snapshot-creation-report:SnapshotCreationFailed test.appstudio.openshift.io/source-repo-url:https://github.com/redhat-appstudio-qe/konflux-test-integration-status-report test.appstudio.openshift.io/status:[{&#34;completionTime&#34;:&#34;2026-10-06T17:14:42.11543174Z&#34;,&#34;details&#34;:&#34;Integration test failed&#34;,&#34;isOptionalScenario&#34;:true,&#34;lastUpdateTime&#34;:&#34;2026-10-06T17:15:23Z&#34;,&#34;scenario&#34;:&#34;integration-test-4vdd&#34;,&#34;startTime&#34;:&#34;2026-10-06T17:14:30.715541832Z&#34;,&#34;status&#34;:&#34;TestFail&#34;,&#34;testPipelineRunName&#34;:&#34;integration-test-4vdd-hdp78&#34;},{&#34;completionTime&#34;:&#34;2026-10-06T17:14:40.115168636Z&#34;,&#34;details&#34;:&#34;Integration test passed&#34;,&#34;lastUpdateTime&#34;:&#34;2026-10-06T17:14:40.115168636Z&#34;,&#34;scenario&#34;:&#34;integration-test-3nxh&#34;,&#34;startTime&#34;:&#34;2026-10-06T17:14:29.183066375Z&#34;,&#34;status&#34;:&#34;TestPassed&#34;,&#34;testPipelineRunName&#34;:&#34;integration-test-3nxh-fbbgl&#34;},{&#34;completionTime&#34;:&#34;2026-10-06T17:14:40.615290494Z&#34;,&#34;details&#34;:&#34;Integration test failed&#34;,&#34;lastUpdateTime&#34;:&#34;2026-10-06T17:14:40.615290494Z&#34;,&#34;scenario&#34;:&#34;integration-test-79tm&#34;,&#34;startTime&#34;:&#34;2026-10-06T17:14:30.115823901Z&#34;,&#34;status&#34;:&#34;TestFail&#34;,&#34;testPipelineRunName&#34;:&#34;integration-test-79tm-6d9rq&#34;}]]&#xA;&lt; Exit [It] should set the git-reporting-failure annotation correctly - /tmp/tmp.jToXo61xWY/repo/e2e-tests/tests/integration-service/status-reporting-to-pullrequest.go:276 @ 10/06/26 17:15:53.117 (29.216s)&#xA;&gt; Enter [AfterEach] [integration-service-suite Status Reporting of Integration tests] - /tmp/tmp.jToXo61xWY/repo/e2e-tests/tests/integration-service/status-reporting-to-pullrequest.go:42 @ 10/06/26 17:15:53.118&#xA;&lt; Exit [AfterEach] [integration-service-suite Status Reporting of Integration tests] - /tmp/tmp.jToXo61xWY/repo/e2e-tests/tests/integration-service/status-reporting-to-pullrequest.go:42 @ 10/06/26 17:15:53.118 (0s)&#xA;</system-err>
          </testcase>
          <testcase name="[It] [integration-service-suite Status Reporting of Integration tests] with status reporting of Integration tests in CheckRuns when build pipelinerun fails build pipelinerun is created but fails [integration-service, github-status-reporting]" classname="Red Hat App Studio E2E tests" status="passed" time="16.018204074">
              <system-err>&gt; Enter [It] build pipelinerun is created but fails - /tmp/tmp.jToXo61xWY/repo/e2e-tests/tests/integration-service/status-reporting-to-pullrequest.go:323 @ 10/06/26 17:15:53.118&#xA;Waiting for pipeline &#34;failing-build-plr-t9tl&#34; to finish&#xA;&lt; Exit [It] build pipelinerun is created but fails - /tmp/tmp.jToXo61xWY/repo/e2e-tests/tests/integration-service/status-reporting-to-pullrequest.go:323 @ 10/06/26 17:16:09.136 (16.018s)&#xA;&gt; Enter [AfterEach] [integration-service-suite Status Reporting of Integration tests] - /tmp/tmp.jToXo61xWY/repo/e2e-tests/tests/integration-service/status-reporting-to-pullrequest.go:42 @ 10/06/26 17:16:09.136&#xA;&lt; Exit [AfterEach] [integration-service-suite Status Reporting of Integration tests] - /tmp/tmp.jToXo61xWY/repo/e2e-tests/tests/integration-service/status-reporting-to-pullrequest.go:42 @ 10/06/26 17:16:09.136 (0s)&#xA;</system-err>
          </testcase>
          <testcase name="[It] [integration-service-suite Status Reporting of Integration tests] with status reporting of Integration tests in CheckRuns when build pipelinerun fails build pipelinerun failure is reported to integration test checkRun [integration-service, github-status-reporting]" classname="Red Hat App Studio E2E tests" status="passed" time="68.628627532">
              <system-err>&gt; Enter [It] build pipelinerun failure is reported to integration test checkRun - /tmp/tmp.jToXo61xWY/repo/e2e-tests/tests/integration-service/status-reporting-to-pullrequest.go:368 @ 10/06/26 17:16:09.136&#xA;failed to check expected checkRun text, actual text is %!s(&lt;nil&gt;): &#xA;%!(EXTRA string=build pipelinerun stat-rep-uq5a/failing-build-plr-t9tl is still in progress)&#xA;&lt; Exit [It] build pipelinerun failure is reported to integration test checkRun - /tmp/tmp.jToXo61xWY/repo/e2e-tests/tests/integration-service/status-reporting-to-pullrequest.go:368 @ 10/06/26 17:16:29.759 (20.623s)&#xA;&gt; Enter [AfterAll] with status reporting of Integration tests in CheckRuns - /tmp/tmp.jToXo61xWY/repo/e2e-tests/tests/integration-service/status-reporting-to-pullrequest.go:92 @ 10/06/26 17:16:29.759&#xA;&lt; Exit [AfterAll] with status reporting of Integration tests in CheckRuns - /tmp/tmp.jToXo61xWY/repo/e2e-tests/tests/integration-service/status-reporting-to-pullrequest.go:92 @ 10/06/26 17:17:17.764 (48.005s)&#xA;&gt; Enter [AfterEach] [integration-service-suite Status Reporting of Integration tests] - /tmp/tmp.jToXo61xWY/repo/e2e-tests/tests/integration-service/status-reporting-to-pullrequest.go:42 @ 10/06/26 17:17:17.764&#xA;&lt; Exit [AfterEach] [integration-service-suite Status Reporting of Integration tests] - /tmp/tmp.jToXo61xWY/repo/e2e-tests/tests/integration-service/status-reporting-to-pullrequest.go:42 @ 10/06/26 17:17:17.765 (0s)&#xA;</system-err>
          </testcase>
          <testcase name="[It] [integration-service-suite Creation of group snapshots for monorepo and multiple repos] with status reporting of Integration tests in CheckRuns when we start creation of a new Component A creates the Component A successfully [integration-service, group-snapshot-creation]" classname="Red Hat App Studio E2E tests" status="passed" time="12.706422486">
              <system-err>&gt; Enter [BeforeAll] with status reporting of Integration tests in CheckRuns - /tmp/tmp.jToXo61xWY/repo/e2e-tests/tests/integration-service/group-snapshots-tests.go:60 @ 10/06/26 17:17:17.765&#xA;Successfully acquired repository lock for namespace group-rojh&#xA;&lt; Exit [BeforeAll] with status reporting of Integration tests in CheckRuns - /tmp/tmp.jToXo61xWY/repo/e2e-tests/tests/integration-service/group-snapshots-tests.go:60 @ 10/06/26 17:17:20.459 (2.694s)&#xA;&gt; Enter [It] creates the Component A successfully - /tmp/tmp.jToXo61xWY/repo/e2e-tests/tests/integration-service/group-snapshots-tests.go:205 @ 10/06/26 17:17:20.459&#xA;&lt; Exit [It] creates the Component A successfully - /tmp/tmp.jToXo61xWY/repo/e2e-tests/tests/integration-service/group-snapshots-tests.go:205 @ 10/06/26 17:17:30.471 (10.012s)&#xA;&gt; Enter [AfterEach] [integration-service-suite Creation of group snapshots for monorepo and multiple repos] - /tmp/tmp.jToXo61xWY/repo/e2e-tests/tests/integration-service/group-snapshots-tests.go:50 @ 10/06/26 17:17:30.471&#xA;&lt; Exit [AfterEach] [integration-service-suite Creation of group snapshots for monorepo and multiple repos] - /tmp/tmp.jToXo61xWY/repo/e2e-tests/tests/integration-service/group-snapshots-tests.go:50 @ 10/06/26 17:17:30.471 (0s)&#xA;</system-err>
          </testcase>
          <testcase name="[It] [integration-service-suite Creation of group snapshots for monorepo and multiple repos] with status reporting of Integration tests in CheckRuns when we start creation of a new Component A triggers a Build PipelineRun for componentA go-component [integration-service, group-snapshot-creation]" classname="Red Hat App Studio E2E tests" status="passed" time="20.011757681">
              <system-err>&gt; Enter [It] triggers a Build PipelineRun for componentA go-component - /tmp/tmp.jToXo61xWY/repo/e2e-tests/tests/integration-service/group-snapshots-tests.go:213 @ 10/06/26 17:17:30.471&#xA;Build PipelineRun has not been created yet for the componentA group-rojh/go-component-wne18x&#xA;&lt; Exit [It] triggers a Build PipelineRun for componentA go-component - /tmp/tmp.jToXo61xWY/repo/e2e-tests/tests/integration-service/group-snapshots-tests.go:213 @ 10/06/26 17:17:50.483 (20.012s)&#xA;&gt; Enter [AfterEach] [integration-service-suite Creation of group snapshots for monorepo and multiple repos] - /tmp/tmp.jToXo61xWY/repo/e2e-tests/tests/integration-service/group-snapshots-tests.go:50 @ 10/06/26 17:17:50.483&#xA;&lt; Exit [AfterEach] [integration-service-suite Creation of group snapshots for monorepo and multiple repos] - /tmp/tmp.jToXo61xWY/repo/e2e-tests/tests/integration-service/group-snapshots-tests.go:50 @ 10/06/26 17:17:50.483 (0s)&#xA;</system-err>
          </testcase>
          <testcase name="[It] [integration-service-suite Creation of group snapshots for monorepo and multiple repos] with status reporting of Integration tests in CheckRuns when we start creation of a new Component A does not contain an annotation with a Snapshot Name [integration-service, group-snapshot-creation]" classname="Red Hat App Studio E2E tests" status="passed" time="8.7192e-05">
              <system-err>&gt; Enter [It] does not contain an annotation with a Snapshot Name - /tmp/tmp.jToXo61xWY/repo/e2e-tests/tests/integration-service/group-snapshots-tests.go:227 @ 10/06/26 17:17:50.483&#xA;&lt; Exit [It] does not contain an annotation with a Snapshot Name - /tmp/tmp.jToXo61xWY/repo/e2e-tests/tests/integration-service/group-snapshots-tests.go:227 @ 10/06/26 17:17:50.483 (0s)&#xA;&gt; Enter [AfterEach] [integration-service-suite Creation of group snapshots for monorepo and multiple repos] - /tmp/tmp.jToXo61xWY/repo/e2e-tests/tests/integration-service/group-snapshots-tests.go:50 @ 10/06/26 17:17:50.483&#xA;&lt; Exit [AfterEach] [integration-service-suite Creation of group snapshots for monorepo and multiple repos] - /tmp/tmp.jToXo61xWY/repo/e2e-tests/tests/integration-service/group-snapshots-tests.go:50 @ 10/06/26 17:17:50.483 (0s)&#xA;</system-err>
          </testcase>
          <testcase name="[It] [integration-service-suite Creation of group snapshots for monorepo and multiple repos] with status reporting of Integration tests in CheckRuns when we start creation of a new Component A should lead to build PipelineRunA finishing successfully [integration-service, group-snapshot-creation]" classname="Red Hat App Studio E2E tests" status="passed" time="360.010406022">
              <system-err>&gt; Enter [It] should lead to build PipelineRunA finishing successfully - /tmp/tmp.jToXo61xWY/repo/e2e-tests/tests/integration-service/group-snapshots-tests.go:231 @ 10/06/26 17:17:50.483&#xA;PipelineRun go-component-wne18x-on-pull-request-tzmsf found for Component group-rojh/go-component-wne18x&#xA;PipelineRun go-component-wne18x-on-pull-request-tzmsf reason: Running&#xA;PipelineRun go-component-wne18x-on-pull-request-tzmsf reason: Running&#xA;PipelineRun go-component-wne18x-on-pull-request-tzmsf reason: Running&#xA;PipelineRun go-component-wne18x-on-pull-request-tzmsf reason: Running&#xA;PipelineRun go-component-wne18x-on-pull-request-tzmsf reason: Running&#xA;PipelineRun go-component-wne18x-on-pull-request-tzmsf reason: Running&#xA;PipelineRun go-component-wne18x-on-pull-request-tzmsf reason: Running&#xA;PipelineRun go-component-wne18x-on-pull-request-tzmsf reason: Running&#xA;PipelineRun go-component-wne18x-on-pull-request-tzmsf reason: Running&#xA;PipelineRun go-component-wne18x-on-pull-request-tzmsf reason: Running&#xA;PipelineRun go-component-wne18x-on-pull-request-tzmsf reason: Running&#xA;PipelineRun go-component-wne18x-on-pull-request-tzmsf reason: Running&#xA;PipelineRun go-component-wne18x-on-pull-request-tzmsf reason: Running&#xA;PipelineRun go-component-wne18x-on-pull-request-tzmsf reason: Running&#xA;PipelineRun go-component-wne18x-on-pull-request-tzmsf reason: Running&#xA;PipelineRun go-component-wne18x-on-pull-request-tzmsf reason: Running&#xA;PipelineRun go-component-wne18x-on-pull-request-tzmsf reason: Running&#xA;PipelineRun go-component-wne18x-on-pull-request-tzmsf reason: Running&#xA;PipelineRun go-component-wne18x-on-pull-request-tzmsf reason: Completed&#xA;&lt; Exit [It] should lead to build PipelineRunA finishing successfully - /tmp/tmp.jToXo61xWY/repo/e2e-tests/tests/integration-service/group-snapshots-tests.go:231 @ 10/06/26 17:23:50.494 (6m0.01s)&#xA;&gt; Enter [AfterEach] [integration-service-suite Creation of group snapshots for monorepo and multiple repos] - /tmp/tmp.jToXo61xWY/repo/e2e-tests/tests/integration-service/group-snapshots-tests.go:50 @ 10/06/26 17:23:50.494&#xA;&lt; Exit [AfterEach] [integration-service-suite Creation of group snapshots for monorepo and multiple repos] - /tmp/tmp.jToXo61xWY/repo/e2e-tests/tests/integration-service/group-snapshots-tests.go:50 @ 10/06/26 17:23:50.494 (0s)&#xA;</system-err>
          </testcase>
          <testcase name="[It] [integration-service-suite Creation of group snapshots for monorepo and multiple repos] with status reporting of Integration tests in CheckRuns when we start creation of a new Component A should lead to a PaC PR creation for componentA go-component [integration-service, group-snapshot-creation]" classname="Red Hat App Studio E2E tests" status="passed" time="0.411973559">
              <system-err>&gt; Enter [It] should lead to a PaC PR creation for componentA go-component - /tmp/tmp.jToXo61xWY/repo/e2e-tests/tests/integration-service/group-snapshots-tests.go:236 @ 10/06/26 17:23:50.494&#xA;&lt; Exit [It] should lead to a PaC PR creation for componentA go-component - /tmp/tmp.jToXo61xWY/repo/e2e-tests/tests/integration-service/group-snapshots-tests.go:236 @ 10/06/26 17:23:50.906 (412ms)&#xA;&gt; Enter [AfterEach] [integration-service-suite Creation of group snapshots for monorepo and multiple repos] - /tmp/tmp.jToXo61xWY/repo/e2e-tests/tests/integration-service/group-snapshots-tests.go:50 @ 10/06/26 17:23:50.906&#xA;&lt; Exit [AfterEach] [integration-service-suite Creation of group snapshots for monorepo and multiple repos] - /tmp/tmp.jToXo61xWY/repo/e2e-tests/tests/integration-service/group-snapshots-tests.go:50 @ 10/06/26 17:23:50.906 (0s)&#xA;</system-err>
          </testcase>
          <testcase name="[It] [integration-service-suite Creation of group snapshots for monorepo and multiple repos] with status reporting of Integration tests in CheckRuns when the Build PLRA is finished successfully checks if the Snapshot is created [integration-service, group-snapshot-creation]" classname="Red Hat App Studio E2E tests" status="passed" time="0.003001907">
              <system-err>&gt; Enter [It] checks if the Snapshot is created - /tmp/tmp.jToXo61xWY/repo/e2e-tests/tests/integration-service/group-snapshots-tests.go:258 @ 10/06/26 17:23:50.906&#xA;&lt; Exit [It] checks if the Snapshot is created - /tmp/tmp.jToXo61xWY/repo/e2e-tests/tests/integration-service/group-snapshots-tests.go:258 @ 10/06/26 17:23:50.909 (3ms)&#xA;&gt; Enter [AfterEach] [integration-service-suite Creation of group snapshots for monorepo and multiple repos] - /tmp/tmp.jToXo61xWY/repo/e2e-tests/tests/integration-service/group-snapshots-tests.go:50 @ 10/06/26 17:23:50.909&#xA;&lt; Exit [AfterEach] [integration-service-suite Creation of group snapshots for monorepo and multiple repos] - /tmp/tmp.jToXo61xWY/repo/e2e-tests/tests/integration-service/group-snapshots-tests.go:50 @ 10/06/26 17:23:50.909 (0s)&#xA;</system-err>
          </testcase>
          <testcase name="[It] [integration-service-suite Creation of group snapshots for monorepo and multiple repos] with status reporting of Integration tests in CheckRuns when the Build PLRA is finished successfully should find the related Integration PipelineRuns [integration-service, group-snapshot-creation]" classname="Red Hat App Studio E2E tests" status="passed" time="20.008299267">
              <system-err>&gt; Enter [It] should find the related Integration PipelineRuns - /tmp/tmp.jToXo61xWY/repo/e2e-tests/tests/integration-service/group-snapshots-tests.go:263 @ 10/06/26 17:23:50.909&#xA;PipelineRun has not been created yet for test scenario %s and snapshot %s/%s integration-test-zomp group-rojh integ-app-wis4-20261006-171731-000&#xA;&lt; Exit [It] should find the related Integration PipelineRuns - /tmp/tmp.jToXo61xWY/repo/e2e-tests/tests/integration-service/group-snapshots-tests.go:263 @ 10/06/26 17:24:10.917 (20.008s)&#xA;&gt; Enter [AfterEach] [integration-service-suite Creation of group snapshots for monorepo and multiple repos] - /tmp/tmp.jToXo61xWY/repo/e2e-tests/tests/integration-service/group-snapshots-tests.go:50 @ 10/06/26 17:24:10.917&#xA;&lt; Exit [AfterEach] [integration-service-suite Creation of group snapshots for monorepo and multiple repos] - /tmp/tmp.jToXo61xWY/repo/e2e-tests/tests/integration-service/group-snapshots-tests.go:50 @ 10/06/26 17:24:10.917 (0s)&#xA;</system-err>
          </testcase>
          <testcase name="[It] [integration-service-suite Creation of group snapshots for monorepo and multiple repos] with status reporting of Integration tests in CheckRuns when the Build PLRA is finished successfully integration pipeline should end up with success [integration-service, group-snapshot-creation]" classname="Red Hat App Studio E2E tests" status="passed" time="0.003464187">
              <system-err>&gt; Enter [It] integration pipeline should end up with success - /tmp/tmp.jToXo61xWY/repo/e2e-tests/tests/integration-service/group-snapshots-tests.go:270 @ 10/06/26 17:24:10.917&#xA;PipelineRun integration-resolver-pipelinerun-8b2gp reason: Succeeded&#xA;&lt; Exit [It] integration pipeline should end up with success - /tmp/tmp.jToXo61xWY/repo/e2e-tests/tests/integration-service/group-snapshots-tests.go:270 @ 10/06/26 17:24:10.921 (3ms)&#xA;&gt; Enter [AfterEach] [integration-service-suite Creation of group snapshots for monorepo and multiple repos] - /tmp/tmp.jToXo61xWY/repo/e2e-tests/tests/integration-service/group-snapshots-tests.go:50 @ 10/06/26 17:24:10.921&#xA;&lt; Exit [AfterEach] [integration-service-suite Creation of group snapshots for monorepo and multiple repos] - /tmp/tmp.jToXo61xWY/repo/e2e-tests/tests/integration-service/group-snapshots-tests.go:50 @ 10/06/26 17:24:10.921 (0s)&#xA;</system-err>
          </testcase>
          <testcase name="[It] [integration-service-suite Creation of group snapshots for monorepo and multiple repos] with status reporting of Integration tests in CheckRuns when the Snapshot testing is completed successfully should merge the init PaC PR successfully [integration-service, group-snapshot-creation]" classname="Red Hat App Studio E2E tests" status="passed" time="2.393371737">
              <system-err>&gt; Enter [It] should merge the init PaC PR successfully - /tmp/tmp.jToXo61xWY/repo/e2e-tests/tests/integration-service/group-snapshots-tests.go:277 @ 10/06/26 17:24:10.921&#xA;merged result sha: e545d13a36ff4556e666a2ec11bf51ef75889779 for PR #25465&#xA;&lt; Exit [It] should merge the init PaC PR successfully - /tmp/tmp.jToXo61xWY/repo/e2e-tests/tests/integration-service/group-snapshots-tests.go:277 @ 10/06/26 17:24:13.314 (2.393s)&#xA;&gt; Enter [AfterEach] [integration-service-suite Creation of group snapshots for monorepo and multiple repos] - /tmp/tmp.jToXo61xWY/repo/e2e-tests/tests/integration-service/group-snapshots-tests.go:50 @ 10/06/26 17:24:13.314&#xA;&lt; Exit [AfterEach] [integration-service-suite Creation of group snapshots for monorepo and multiple repos] - /tmp/tmp.jToXo61xWY/repo/e2e-tests/tests/integration-service/group-snapshots-tests.go:50 @ 10/06/26 17:24:13.314 (0s)&#xA;</system-err>
          </testcase>
          <testcase name="[It] [integration-service-suite Creation of group snapshots for monorepo and multiple repos] with status reporting of Integration tests in CheckRuns when we start creation of a new Component B creates the Component B successfully [integration-service, group-snapshot-creation]" classname="Red Hat App Studio E2E tests" status="passed" time="10.014040477">
              <system-err>&gt; Enter [It] creates the Component B successfully - /tmp/tmp.jToXo61xWY/repo/e2e-tests/tests/integration-service/group-snapshots-tests.go:296 @ 10/06/26 17:24:13.314&#xA;&lt; Exit [It] creates the Component B successfully - /tmp/tmp.jToXo61xWY/repo/e2e-tests/tests/integration-service/group-snapshots-tests.go:296 @ 10/06/26 17:24:23.328 (10.014s)&#xA;&gt; Enter [AfterEach] [integration-service-suite Creation of group snapshots for monorepo and multiple repos] - /tmp/tmp.jToXo61xWY/repo/e2e-tests/tests/integration-service/group-snapshots-tests.go:50 @ 10/06/26 17:24:23.328&#xA;&lt; Exit [AfterEach] [integration-service-suite Creation of group snapshots for monorepo and multiple repos] - /tmp/tmp.jToXo61xWY/repo/e2e-tests/tests/integration-service/group-snapshots-tests.go:50 @ 10/06/26 17:24:23.328 (0s)&#xA;</system-err>
          </testcase>
          <testcase name="[It] [integration-service-suite Creation of group snapshots for monorepo and multiple repos] with status reporting of Integration tests in CheckRuns when we start creation of a new Component B triggers a Build PipelineRun for component python-component [integration-service, group-snapshot-creation]" classname="Red Hat App Studio E2E tests" status="passed" time="20.010940072">
              <system-err>&gt; Enter [It] triggers a Build PipelineRun for component python-component - /tmp/tmp.jToXo61xWY/repo/e2e-tests/tests/integration-service/group-snapshots-tests.go:304 @ 10/06/26 17:24:23.328&#xA;Build PipelineRun has not been created yet for the componentB group-rojh/python-component-2uipms&#xA;&lt; Exit [It] triggers a Build PipelineRun for component python-component - /tmp/tmp.jToXo61xWY/repo/e2e-tests/tests/integration-service/group-snapshots-tests.go:304 @ 10/06/26 17:24:43.339 (20.011s)&#xA;&gt; Enter [AfterEach] [integration-service-suite Creation of group snapshots for monorepo and multiple repos] - /tmp/tmp.jToXo61xWY/repo/e2e-tests/tests/integration-service/group-snapshots-tests.go:50 @ 10/06/26 17:24:43.339&#xA;&lt; Exit [AfterEach] [integration-service-suite Creation of group snapshots for monorepo and multiple repos] - /tmp/tmp.jToXo61xWY/repo/e2e-tests/tests/integration-service/group-snapshots-tests.go:50 @ 10/06/26 17:24:43.339 (0s)&#xA;</system-err>
          </testcase>
          <testcase name="[It] [integration-service-suite Creation of group snapshots for monorepo and multiple repos] with status reporting of Integration tests in CheckRuns when we start creation of a new Component B does not contain an annotation with a Snapshot Name [integration-service, group-snapshot-creation]" classname="Red Hat App Studio E2E tests" status="passed" time="5.8862e-05">
              <system-err>&gt; Enter [It] does not contain an annotation with a Snapshot Name - /tmp/tmp.jToXo61xWY/repo/e2e-tests/tests/integration-service/group-snapshots-tests.go:318 @ 10/06/26 17:24:43.339&#xA;&lt; Exit [It] does not contain an annotation with a Snapshot Name - /tmp/tmp.jToXo61xWY/repo/e2e-tests/tests/integration-service/group-snapshots-tests.go:318 @ 10/06/26 17:24:43.339 (0s)&#xA;&gt; Enter [AfterEach] [integration-service-suite Creation of group snapshots for monorepo and multiple repos] - /tmp/tmp.jToXo61xWY/repo/e2e-tests/tests/integration-service/group-snapshots-tests.go:50 @ 10/06/26 17:24:43.339&#xA;&lt; Exit [AfterEach] [integration-service-suite Creation of group snapshots for monorepo and multiple repos] - /tmp/tmp.jToXo61xWY/repo/e2e-tests/tests/integration-service/group-snapshots-tests.go:50 @ 10/06/26 17:24:43.339 (0s)&#xA;</system-err>
          </testcase>
          <testcase name="[It] [integration-service-suite Creation of group snapshots for monorepo and multiple repos] with status reporting of Integration tests in CheckRuns when we start creation of a new Component B should lead to build PipelineRun finishing successfully [integration-service, group-snapshot-creation]" classname="Red Hat App Studio E2E tests" status="passed" time="420.014072107">
              <system-err>&gt; Enter [It] should lead to build PipelineRun finishing successfully - /tmp/tmp.jToXo61xWY/repo/e2e-tests/tests/integration-service/group-snapshots-tests.go:322 @ 10/06/26 17:24:43.339&#xA;PipelineRun python-component-2uipms-on-pull-request-nfwbr found for Component group-rojh/python-component-2uipms&#xA;PipelineRun python-component-2uipms-on-pull-request-nfwbr reason: Running&#xA;PipelineRun python-component-2uipms-on-pull-request-nfwbr reason: Running&#xA;PipelineRun python-component-2uipms-on-pull-request-nfwbr reason: Running&#xA;PipelineRun python-component-2uipms-on-pull-request-nfwbr reason: Running&#xA;PipelineRun python-component-2uipms-on-pull-request-nfwbr reason: Running&#xA;PipelineRun python-component-2uipms-on-pull-request-nfwbr reason: Running&#xA;PipelineRun python-component-2uipms-on-pull-request-nfwbr reason: Running&#xA;PipelineRun python-component-2uipms-on-pull-request-nfwbr reason: Running&#xA;PipelineRun python-component-2uipms-on-pull-request-nfwbr reason: Running&#xA;PipelineRun python-component-2uipms-on-pull-request-nfwbr reason: Running&#xA;PipelineRun python-component-2uipms-on-pull-request-nfwbr reason: Running&#xA;PipelineRun python-component-2uipms-on-pull-request-nfwbr reason: Running&#xA;PipelineRun python-component-2uipms-on-pull-request-nfwbr reason: Running&#xA;PipelineRun python-component-2uipms-on-pull-request-nfwbr reason: Running&#xA;PipelineRun python-component-2uipms-on-pull-request-nfwbr reason: Running&#xA;PipelineRun python-component-2uipms-on-pull-request-nfwbr reason: Running&#xA;PipelineRun python-component-2uipms-on-pull-request-nfwbr reason: Running&#xA;PipelineRun python-component-2uipms-on-pull-request-nfwbr reason: Running&#xA;PipelineRun python-component-2uipms-on-pull-request-nfwbr reason: Running&#xA;PipelineRun python-component-2uipms-on-pull-request-nfwbr reason: Running&#xA;PipelineRun python-component-2uipms-on-pull-request-nfwbr reason: Running&#xA;PipelineRun integration-resolver-pipelinerun-bfkvk reason: Succeeded&#xA;&lt; Exit [It] should lead to build PipelineRun finishing successfully - /tmp/tmp.jToXo61xWY/repo/e2e-tests/tests/integration-service/group-snapshots-tests.go:322 @ 10/06/26 17:31:43.353 (7m0.014s)&#xA;&gt; Enter [AfterEach] [integration-service-suite Creation of group snapshots for monorepo and multiple repos] - /tmp/tmp.jToXo61xWY/repo/e2e-tests/tests/integration-service/group-snapshots-tests.go:50 @ 10/06/26 17:31:43.353&#xA;&lt; Exit [AfterEach] [integration-service-suite Creation of group snapshots for monorepo and multiple repos] - /tmp/tmp.jToXo61xWY/repo/e2e-tests/tests/integration-service/group-snapshots-tests.go:50 @ 10/06/26 17:31:43.353 (0s)&#xA;</system-err>
          </testcase>
          <testcase name="[It] [integration-service-suite Creation of group snapshots for monorepo and multiple repos] with status reporting of Integration tests in CheckRuns when we start creation of a new Component B should lead to a PaC PR creation for component python-component [integration-service, group-snapshot-creation]" classname="Red Hat App Studio E2E tests" status="passed" time="0.401417495">
              <system-err>&gt; Enter [It] should lead to a PaC PR creation for component python-component - /tmp/tmp.jToXo61xWY/repo/e2e-tests/tests/integration-service/group-snapshots-tests.go:327 @ 10/06/26 17:31:43.354&#xA;&lt; Exit [It] should lead to a PaC PR creation for component python-component - /tmp/tmp.jToXo61xWY/repo/e2e-tests/tests/integration-service/group-snapshots-tests.go:327 @ 10/06/26 17:31:43.755 (401ms)&#xA;&gt; Enter [AfterEach] [integration-service-suite Creation of group snapshots for monorepo and multiple repos] - /tmp/tmp.jToXo61xWY/repo/e2e-tests/tests/integration-service/group-snapshots-tests.go:50 @ 10/06/26 17:31:43.755&#xA;&lt; Exit [AfterEach] [integration-service-suite Creation of group snapshots for monorepo and multiple repos] - /tmp/tmp.jToXo61xWY/repo/e2e-tests/tests/integration-service/group-snapshots-tests.go:50 @ 10/06/26 17:31:43.755 (0s)&#xA;</system-err>
          </testcase>
          <testcase name="[It] [integration-service-suite Creation of group snapshots for monorepo and multiple repos] with status reporting of Integration tests in CheckRuns when the Build PLR is finished successfully checks if the Snapshot is created [integration-service, group-snapshot-creation]" classname="Red Hat App Studio E2E tests" status="passed" time="0.004291315">
              <system-err>&gt; Enter [It] checks if the Snapshot is created - /tmp/tmp.jToXo61xWY/repo/e2e-tests/tests/integration-service/group-snapshots-tests.go:349 @ 10/06/26 17:31:43.755&#xA;&lt; Exit [It] checks if the Snapshot is created - /tmp/tmp.jToXo61xWY/repo/e2e-tests/tests/integration-service/group-snapshots-tests.go:349 @ 10/06/26 17:31:43.759 (4ms)&#xA;&gt; Enter [AfterEach] [integration-service-suite Creation of group snapshots for monorepo and multiple repos] - /tmp/tmp.jToXo61xWY/repo/e2e-tests/tests/integration-service/group-snapshots-tests.go:50 @ 10/06/26 17:31:43.759&#xA;&lt; Exit [AfterEach] [integration-service-suite Creation of group snapshots for monorepo and multiple repos] - /tmp/tmp.jToXo61xWY/repo/e2e-tests/tests/integration-service/group-snapshots-tests.go:50 @ 10/06/26 17:31:43.759 (0s)&#xA;</system-err>
          </testcase>
          <testcase name="[It] [integration-service-suite Creation of group snapshots for monorepo and multiple repos] with status reporting of Integration tests in CheckRuns when the Build PLR is finished successfully should find the related Integration PipelineRuns [integration-service, group-snapshot-creation]" classname="Red Hat App Studio E2E tests" status="passed" time="0.003941577">
              <system-err>&gt; Enter [It] should find the related Integration PipelineRuns - /tmp/tmp.jToXo61xWY/repo/e2e-tests/tests/integration-service/group-snapshots-tests.go:354 @ 10/06/26 17:31:43.759&#xA;&lt; Exit [It] should find the related Integration PipelineRuns - /tmp/tmp.jToXo61xWY/repo/e2e-tests/tests/integration-service/group-snapshots-tests.go:354 @ 10/06/26 17:31:43.763 (4ms)&#xA;&gt; Enter [AfterEach] [integration-service-suite Creation of group snapshots for monorepo and multiple repos] - /tmp/tmp.jToXo61xWY/repo/e2e-tests/tests/integration-service/group-snapshots-tests.go:50 @ 10/06/26 17:31:43.763&#xA;&lt; Exit [AfterEach] [integration-service-suite Creation of group snapshots for monorepo and multiple repos] - /tmp/tmp.jToXo61xWY/repo/e2e-tests/tests/integration-service/group-snapshots-tests.go:50 @ 10/06/26 17:31:43.763 (0s)&#xA;</system-err>
          </testcase>
          <testcase name="[It] [integration-service-suite Creation of group snapshots for monorepo and multiple repos] with status reporting of Integration tests in CheckRuns when the Build PLR is finished successfully integration pipeline should end up with success [integration-service, group-snapshot-creation]" classname="Red Hat App Studio E2E tests" status="passed" time="0.00360145">
              <system-err>&gt; Enter [It] integration pipeline should end up with success - /tmp/tmp.jToXo61xWY/repo/e2e-tests/tests/integration-service/group-snapshots-tests.go:361 @ 10/06/26 17:31:43.763&#xA;PipelineRun integration-resolver-pipelinerun-bfkvk reason: Succeeded&#xA;&lt; Exit [It] integration pipeline should end up with success - /tmp/tmp.jToXo61xWY/repo/e2e-tests/tests/integration-service/group-snapshots-tests.go:361 @ 10/06/26 17:31:43.767 (4ms)&#xA;&gt; Enter [AfterEach] [integration-service-suite Creation of group snapshots for monorepo and multiple repos] - /tmp/tmp.jToXo61xWY/repo/e2e-tests/tests/integration-service/group-snapshots-tests.go:50 @ 10/06/26 17:31:43.767&#xA;&lt; Exit [AfterEach] [integration-service-suite Creation of group snapshots for monorepo and multiple repos] - /tmp/tmp.jToXo61xWY/repo/e2e-tests/tests/integration-service/group-snapshots-tests.go:50 @ 10/06/26 17:31:43.767 (0s)&#xA;</system-err>
          </testcase>
          <testcase name="[It] [integration-service-suite Creation of group snapshots for monorepo and multiple repos] with status reporting of Integration tests in CheckRuns when the Snapshot testing is completed successfully should merge the init PaC PR successfully [integration-service, group-snapshot-creation]" classname="Red Hat App Studio E2E tests" status="passed" time="3.167389775">
              <system-err>&gt; Enter [It] should merge the init PaC PR successfully - /tmp/tmp.jToXo61xWY/repo/e2e-tests/tests/integration-service/group-snapshots-tests.go:368 @ 10/06/26 17:31:43.767&#xA;merged result sha: 9714942b7f19489394c59f8c076f19d379a7629e for PR #25466&#xA;&lt; Exit [It] should merge the init PaC PR successfully - /tmp/tmp.jToXo61xWY/repo/e2e-tests/tests/integration-service/group-snapshots-tests.go:368 @ 10/06/26 17:31:46.934 (3.167s)&#xA;&gt; Enter [AfterEach] [integration-service-suite Creation of group snapshots for monorepo and multiple repos] - /tmp/tmp.jToXo61xWY/repo/e2e-tests/tests/integration-service/group-snapshots-tests.go:50 @ 10/06/26 17:31:46.934&#xA;&lt; Exit [AfterEach] [integration-service-suite Creation of group snapshots for monorepo and multiple repos] - /tmp/tmp.jToXo61xWY/repo/e2e-tests/tests/integration-service/group-snapshots-tests.go:50 @ 10/06/26 17:31:46.934 (0s)&#xA;</system-err>
          </testcase>
          <testcase name="[It] [integration-service-suite Creation of group snapshots for monorepo and multiple repos] with status reporting of Integration tests in CheckRuns when we start creation of a new Component C creates the Component C successfully [integration-service, group-snapshot-creation]" classname="Red Hat App Studio E2E tests" status="passed" time="10.017133342">
              <system-err>&gt; Enter [It] creates the Component C successfully - /tmp/tmp.jToXo61xWY/repo/e2e-tests/tests/integration-service/group-snapshots-tests.go:387 @ 10/06/26 17:31:46.934&#xA;&lt; Exit [It] creates the Component C successfully - /tmp/tmp.jToXo61xWY/repo/e2e-tests/tests/integration-service/group-snapshots-tests.go:387 @ 10/06/26 17:31:56.951 (10.017s)&#xA;&gt; Enter [AfterEach] [integration-service-suite Creation of group snapshots for monorepo and multiple repos] - /tmp/tmp.jToXo61xWY/repo/e2e-tests/tests/integration-service/group-snapshots-tests.go:50 @ 10/06/26 17:31:56.952&#xA;&lt; Exit [AfterEach] [integration-service-suite Creation of group snapshots for monorepo and multiple repos] - /tmp/tmp.jToXo61xWY/repo/e2e-tests/tests/integration-service/group-snapshots-tests.go:50 @ 10/06/26 17:31:56.952 (0s)&#xA;</system-err>
          </testcase>
          <testcase name="[It] [integration-service-suite Creation of group snapshots for monorepo and multiple repos] with status reporting of Integration tests in CheckRuns when we start creation of a new Component C triggers a Build PipelineRun for componentC konflux-test-integration-clone [integration-service, group-snapshot-creation]" classname="Red Hat App Studio E2E tests" status="passed" time="20.011537342">
              <system-err>&gt; Enter [It] triggers a Build PipelineRun for componentC konflux-test-integration-clone - /tmp/tmp.jToXo61xWY/repo/e2e-tests/tests/integration-service/group-snapshots-tests.go:395 @ 10/06/26 17:31:56.952&#xA;Build PipelineRun has not been created yet for the componentC group-rojh/konflux-test-integration-clone-85iyin&#xA;&lt; Exit [It] triggers a Build PipelineRun for componentC konflux-test-integration-clone - /tmp/tmp.jToXo61xWY/repo/e2e-tests/tests/integration-service/group-snapshots-tests.go:395 @ 10/06/26 17:32:16.963 (20.011s)&#xA;&gt; Enter [AfterEach] [integration-service-suite Creation of group snapshots for monorepo and multiple repos] - /tmp/tmp.jToXo61xWY/repo/e2e-tests/tests/integration-service/group-snapshots-tests.go:50 @ 10/06/26 17:32:16.963&#xA;&lt; Exit [AfterEach] [integration-service-suite Creation of group snapshots for monorepo and multiple repos] - /tmp/tmp.jToXo61xWY/repo/e2e-tests/tests/integration-service/group-snapshots-tests.go:50 @ 10/06/26 17:32:16.963 (0s)&#xA;</system-err>
          </testcase>
          <testcase name="[It] [integration-service-suite Creation of group snapshots for monorepo and multiple repos] with status reporting of Integration tests in CheckRuns when we start creation of a new Component C does not contain an annotation with a Snapshot Name [integration-service, group-snapshot-creation]" classname="Red Hat App Studio E2E tests" status="passed" time="6.6781e-05">
              <system-err>&gt; Enter [It] does not contain an annotation with a Snapshot Name - /tmp/tmp.jToXo61xWY/repo/e2e-tests/tests/integration-service/group-snapshots-tests.go:409 @ 10/06/26 17:32:16.963&#xA;&lt; Exit [It] does not contain an annotation with a Snapshot Name - /tmp/tmp.jToXo61xWY/repo/e2e-tests/tests/integration-service/group-snapshots-tests.go:409 @ 10/06/26 17:32:16.963 (0s)&#xA;&gt; Enter [AfterEach] [integration-service-suite Creation of group snapshots for monorepo and multiple repos] - /tmp/tmp.jToXo61xWY/repo/e2e-tests/tests/integration-service/group-snapshots-tests.go:50 @ 10/06/26 17:32:16.963&#xA;&lt; Exit [AfterEach] [integration-service-suite Creation of group snapshots for monorepo and multiple repos] - /tmp/tmp.jToXo61xWY/repo/e2e-tests/tests/integration-service/group-snapshots-tests.go:50 @ 10/06/26 17:32:16.963 (0s)&#xA;</system-err>
          </testcase>
          <testcase name="[It] [integration-service-suite Creation of group snapshots for monorepo and multiple repos] with status reporting of Integration tests in CheckRuns when we start creation of a new Component C should lead to build PipelineRun finishing successfully [integration-service, group-snapshot-creation]" classname="Red Hat App Studio E2E tests" status="passed" time="260.014558918">
              <system-err>&gt; Enter [It] should lead to build PipelineRun finishing successfully - /tmp/tmp.jToXo61xWY/repo/e2e-tests/tests/integration-service/group-snapshots-tests.go:413 @ 10/06/26 17:32:16.963&#xA;PipelineRun konflux-test-integration-clone-85iyin-on-pull-request-tbnvf found for Component group-rojh/konflux-test-integration-clone-85iyin&#xA;PipelineRun konflux-test-integration-clone-85iyin-on-pull-request-tbnvf reason: Running&#xA;PipelineRun konflux-test-integration-clone-85iyin-on-pull-request-tbnvf reason: Running&#xA;PipelineRun konflux-test-integration-clone-85iyin-on-pull-request-tbnvf reason: Running&#xA;PipelineRun konflux-test-integration-clone-85iyin-on-pull-request-tbnvf reason: Running&#xA;PipelineRun konflux-test-integration-clone-85iyin-on-pull-request-tbnvf reason: Running&#xA;PipelineRun konflux-test-integration-clone-85iyin-on-pull-request-tbnvf reason: Running&#xA;PipelineRun konflux-test-integration-clone-85iyin-on-pull-request-tbnvf reason: Running&#xA;PipelineRun konflux-test-integration-clone-85iyin-on-pull-request-tbnvf reason: Running&#xA;PipelineRun konflux-test-integration-clone-85iyin-on-pull-request-tbnvf reason: Running&#xA;PipelineRun konflux-test-integration-clone-85iyin-on-pull-request-tbnvf reason: Running&#xA;PipelineRun konflux-test-integration-clone-85iyin-on-pull-request-tbnvf reason: Running&#xA;PipelineRun konflux-test-integration-clone-85iyin-on-pull-request-tbnvf reason: Running&#xA;PipelineRun konflux-test-integration-clone-85iyin-on-pull-request-tbnvf reason: Running&#xA;PipelineRun konflux-test-integration-clone-85iyin-on-pull-request-tbnvf reason: Completed&#xA;&lt; Exit [It] should lead to build PipelineRun finishing successfully - /tmp/tmp.jToXo61xWY/repo/e2e-tests/tests/integration-service/group-snapshots-tests.go:413 @ 10/06/26 17:36:36.978 (4m20.014s)&#xA;&gt; Enter [AfterEach] [integration-service-suite Creation of group snapshots for monorepo and multiple repos] - /tmp/tmp.jToXo61xWY/repo/e2e-tests/tests/integration-service/group-snapshots-tests.go:50 @ 10/06/26 17:36:36.978&#xA;&lt; Exit [AfterEach] [integration-service-suite Creation of group snapshots for monorepo and multiple repos] - /tmp/tmp.jToXo61xWY/repo/e2e-tests/tests/integration-service/group-snapshots-tests.go:50 @ 10/06/26 17:36:36.978 (0s)&#xA;</system-err>
          </testcase>
          <testcase name="[It] [integration-service-suite Creation of group snapshots for monorepo and multiple repos] with status reporting of Integration tests in CheckRuns when we start creation of a new Component C should lead to a PaC PR creation for componentC konflux-test-integration-clone [integration-service, group-snapshot-creation]" classname="Red Hat App Studio E2E tests" status="passed" time="0.382632954">
              <system-err>&gt; Enter [It] should lead to a PaC PR creation for componentC konflux-test-integration-clone - /tmp/tmp.jToXo61xWY/repo/e2e-tests/tests/integration-service/group-snapshots-tests.go:418 @ 10/06/26 17:36:36.978&#xA;&lt; Exit [It] should lead to a PaC PR creation for componentC konflux-test-integration-clone - /tmp/tmp.jToXo61xWY/repo/e2e-tests/tests/integration-service/group-snapshots-tests.go:418 @ 10/06/26 17:36:37.36 (382ms)&#xA;&gt; Enter [AfterEach] [integration-service-suite Creation of group snapshots for monorepo and multiple repos] - /tmp/tmp.jToXo61xWY/repo/e2e-tests/tests/integration-service/group-snapshots-tests.go:50 @ 10/06/26 17:36:37.361&#xA;&lt; Exit [AfterEach] [integration-service-suite Creation of group snapshots for monorepo and multiple repos] - /tmp/tmp.jToXo61xWY/repo/e2e-tests/tests/integration-service/group-snapshots-tests.go:50 @ 10/06/26 17:36:37.361 (0s)&#xA;</system-err>
          </testcase>
          <testcase name="[It] [integration-service-suite Creation of group snapshots for monorepo and multiple repos] with status reporting of Integration tests in CheckRuns when the Build PLR is finished successfully checks if the Snapshot is created [integration-service, group-snapshot-creation]" classname="Red Hat App Studio E2E tests" status="passed" time="20.01648843">
              <system-err>&gt; Enter [It] checks if the Snapshot is created - /tmp/tmp.jToXo61xWY/repo/e2e-tests/tests/integration-service/group-snapshots-tests.go:440 @ 10/06/26 17:36:37.361&#xA;unable to get the Snapshot within the namespace group-rojh. Error: no snapshot found for component &#39;konflux-test-integration-clone-85iyin&#39;, pipelineRun &#39;konflux-test-integration-clone-85iyin-on-pull-request-tbnvf&#39; in &#39;group-rojh&#39; namespace&#xA;&lt; Exit [It] checks if the Snapshot is created - /tmp/tmp.jToXo61xWY/repo/e2e-tests/tests/integration-service/group-snapshots-tests.go:440 @ 10/06/26 17:36:57.377 (20.016s)&#xA;&gt; Enter [AfterEach] [integration-service-suite Creation of group snapshots for monorepo and multiple repos] - /tmp/tmp.jToXo61xWY/repo/e2e-tests/tests/integration-service/group-snapshots-tests.go:50 @ 10/06/26 17:36:57.377&#xA;&lt; Exit [AfterEach] [integration-service-suite Creation of group snapshots for monorepo and multiple repos] - /tmp/tmp.jToXo61xWY/repo/e2e-tests/tests/integration-service/group-snapshots-tests.go:50 @ 10/06/26 17:36:57.377 (0s)&#xA;</system-err>
          </testcase>
          <testcase name="[It] [integration-service-suite Creation of group snapshots for monorepo and multiple repos] with status reporting of Integration tests in CheckRuns when the Build PLR is finished successfully should find the related Integration PipelineRuns [integration-service, group-snapshot-creation]" classname="Red Hat App Studio E2E tests" status="passed" time="0.003194802">
              <system-err>&gt; Enter [It] should find the related Integration PipelineRuns - /tmp/tmp.jToXo61xWY/repo/e2e-tests/tests/integration-service/group-snapshots-tests.go:445 @ 10/06/26 17:36:57.377&#xA;&lt; Exit [It] should find the related Integration PipelineRuns - /tmp/tmp.jToXo61xWY/repo/e2e-tests/tests/integration-service/group-snapshots-tests.go:445 @ 10/06/26 17:36:57.38 (3ms)&#xA;&gt; Enter [AfterEach] [integration-service-suite Creation of group snapshots for monorepo and multiple repos] - /tmp/tmp.jToXo61xWY/repo/e2e-tests/tests/integration-service/group-snapshots-tests.go:50 @ 10/06/26 17:36:57.38&#xA;&lt; Exit [AfterEach] [integration-service-suite Creation of group snapshots for monorepo and multiple repos] - /tmp/tmp.jToXo61xWY/repo/e2e-tests/tests/integration-service/group-snapshots-tests.go:50 @ 10/06/26 17:36:57.38 (0s)&#xA;</system-err>
          </testcase>
          <testcase name="[It] [integration-service-suite Creation of group snapshots for monorepo and multiple repos] with status reporting of Integration tests in CheckRuns when the Build PLR is finished successfully integration pipeline should end up with success [integration-service, group-snapshot-creation]" classname="Red Hat App Studio E2E tests" status="passed" time="0.00311849">
              <system-err>&gt; Enter [It] integration pipeline should end up with success - /tmp/tmp.jToXo61xWY/repo/e2e-tests/tests/integration-service/group-snapshots-tests.go:452 @ 10/06/26 17:36:57.38&#xA;PipelineRun integration-resolver-pipelinerun-7xr9s reason: Succeeded&#xA;&lt; Exit [It] integration pipeline should end up with success - /tmp/tmp.jToXo61xWY/repo/e2e-tests/tests/integration-service/group-snapshots-tests.go:452 @ 10/06/26 17:36:57.383 (3ms)&#xA;&gt; Enter [AfterEach] [integration-service-suite Creation of group snapshots for monorepo and multiple repos] - /tmp/tmp.jToXo61xWY/repo/e2e-tests/tests/integration-service/group-snapshots-tests.go:50 @ 10/06/26 17:36:57.384&#xA;&lt; Exit [AfterEach] [integration-service-suite Creation of group snapshots for monorepo and multiple repos] - /tmp/tmp.jToXo61xWY/repo/e2e-tests/tests/integration-service/group-snapshots-tests.go:50 @ 10/06/26 17:36:57.384 (0s)&#xA;</system-err>
          </testcase>
          <testcase name="[It] [integration-service-suite Creation of group snapshots for monorepo and multiple repos] with status reporting of Integration tests in CheckRuns when the Snapshot testing is completed successfully should merge the init PaC PR successfully [integration-service, group-snapshot-creation]" classname="Red Hat App Studio E2E tests" status="passed" time="2.32702476">
              <system-err>&gt; Enter [It] should merge the init PaC PR successfully - /tmp/tmp.jToXo61xWY/repo/e2e-tests/tests/integration-service/group-snapshots-tests.go:459 @ 10/06/26 17:36:57.384&#xA;merged result sha: feb27654747ad2f4dafb288f579147e967a29f0c for PR #10916&#xA;&lt; Exit [It] should merge the init PaC PR successfully - /tmp/tmp.jToXo61xWY/repo/e2e-tests/tests/integration-service/group-snapshots-tests.go:459 @ 10/06/26 17:36:59.71 (2.327s)&#xA;&gt; Enter [AfterEach] [integration-service-suite Creation of group snapshots for monorepo and multiple repos] - /tmp/tmp.jToXo61xWY/repo/e2e-tests/tests/integration-service/group-snapshots-tests.go:50 @ 10/06/26 17:36:59.711&#xA;&lt; Exit [AfterEach] [integration-service-suite Creation of group snapshots for monorepo and multiple repos] - /tmp/tmp.jToXo61xWY/repo/e2e-tests/tests/integration-service/group-snapshots-tests.go:50 @ 10/06/26 17:36:59.711 (0s)&#xA;</system-err>
          </testcase>
          <testcase name="[It] [integration-service-suite Creation of group snapshots for monorepo and multiple repos] with status reporting of Integration tests in CheckRuns when both the init PaC PRs are merged should make change to the root folder [integration-service, group-snapshot-creation]" classname="Red Hat App Studio E2E tests" status="passed" time="3.669140062">
              <system-err>&gt; Enter [It] should make change to the root folder - /tmp/tmp.jToXo61xWY/repo/e2e-tests/tests/integration-service/group-snapshots-tests.go:479 @ 10/06/26 17:36:59.711&#xA;PR #25469 got created with sha 2f8505fc6f9959f2ef20803c8f4200e47d530d49&#xA;&lt; Exit [It] should make change to the root folder - /tmp/tmp.jToXo61xWY/repo/e2e-tests/tests/integration-service/group-snapshots-tests.go:479 @ 10/06/26 17:37:03.38 (3.669s)&#xA;&gt; Enter [AfterEach] [integration-service-suite Creation of group snapshots for monorepo and multiple repos] - /tmp/tmp.jToXo61xWY/repo/e2e-tests/tests/integration-service/group-snapshots-tests.go:50 @ 10/06/26 17:37:03.38&#xA;&lt; Exit [AfterEach] [integration-service-suite Creation of group snapshots for monorepo and multiple repos] - /tmp/tmp.jToXo61xWY/repo/e2e-tests/tests/integration-service/group-snapshots-tests.go:50 @ 10/06/26 17:37:03.38 (0s)&#xA;</system-err>
          </testcase>
          <testcase name="[It] [integration-service-suite Creation of group snapshots for monorepo and multiple repos] with status reporting of Integration tests in CheckRuns when both the init PaC PRs are merged should make change to the multiple-repo [integration-service, group-snapshot-creation]" classname="Red Hat App Studio E2E tests" status="passed" time="2.812559082">
              <system-err>&gt; Enter [It] should make change to the multiple-repo - /tmp/tmp.jToXo61xWY/repo/e2e-tests/tests/integration-service/group-snapshots-tests.go:498 @ 10/06/26 17:37:03.38&#xA;PR #10917 got created with sha 045521b6277ee243fba31ea3a7a61e5001e1f210&#xA;&lt; Exit [It] should make change to the multiple-repo - /tmp/tmp.jToXo61xWY/repo/e2e-tests/tests/integration-service/group-snapshots-tests.go:498 @ 10/06/26 17:37:06.192 (2.812s)&#xA;&gt; Enter [AfterEach] [integration-service-suite Creation of group snapshots for monorepo and multiple repos] - /tmp/tmp.jToXo61xWY/repo/e2e-tests/tests/integration-service/group-snapshots-tests.go:50 @ 10/06/26 17:37:06.192&#xA;&lt; Exit [AfterEach] [integration-service-suite Creation of group snapshots for monorepo and multiple repos] - /tmp/tmp.jToXo61xWY/repo/e2e-tests/tests/integration-service/group-snapshots-tests.go:50 @ 10/06/26 17:37:06.192 (0s)&#xA;</system-err>
          </testcase>
          <testcase name="[It] [integration-service-suite Creation of group snapshots for monorepo and multiple repos] with status reporting of Integration tests in CheckRuns when both the init PaC PRs are merged wait for the last components build to finish [integration-service, group-snapshot-creation]" classname="Red Hat App Studio E2E tests" status="passed" time="640.031046996">
              <system-err>&gt; Enter [It] wait for the last components build to finish - /tmp/tmp.jToXo61xWY/repo/e2e-tests/tests/integration-service/group-snapshots-tests.go:515 @ 10/06/26 17:37:06.193&#xA;PipelineRun has not been created yet for the Component group-rojh/go-component-wne18x&#xA;PipelineRun go-component-wne18x-on-pull-request-qt2kc found for Component group-rojh/go-component-wne18x&#xA;PipelineRun go-component-wne18x-on-pull-request-qt2kc reason: ResolvingTaskRef&#xA;PipelineRun go-component-wne18x-on-pull-request-qt2kc reason: Running&#xA;PipelineRun go-component-wne18x-on-pull-request-qt2kc reason: Running&#xA;PipelineRun go-component-wne18x-on-pull-request-qt2kc reason: Running&#xA;PipelineRun go-component-wne18x-on-pull-request-qt2kc reason: Running&#xA;PipelineRun go-component-wne18x-on-pull-request-qt2kc reason: Running&#xA;PipelineRun go-component-wne18x-on-pull-request-qt2kc reason: Running&#xA;PipelineRun go-component-wne18x-on-pull-request-qt2kc reason: Running&#xA;PipelineRun go-component-wne18x-on-pull-request-qt2kc reason: Running&#xA;PipelineRun go-component-wne18x-on-pull-request-qt2kc reason: Running&#xA;PipelineRun go-component-wne18x-on-pull-request-qt2kc reason: Running&#xA;PipelineRun go-component-wne18x-on-pull-request-qt2kc reason: Running&#xA;PipelineRun go-component-wne18x-on-pull-request-qt2kc reason: Running&#xA;PipelineRun go-component-wne18x-on-pull-request-qt2kc reason: Running&#xA;PipelineRun go-component-wne18x-on-pull-request-qt2kc reason: Running&#xA;PipelineRun go-component-wne18x-on-pull-request-qt2kc reason: Running&#xA;PipelineRun go-component-wne18x-on-pull-request-qt2kc reason: Running&#xA;PipelineRun go-component-wne18x-on-pull-request-qt2kc reason: Running&#xA;PipelineRun go-component-wne18x-on-pull-request-qt2kc reason: Running&#xA;PipelineRun go-component-wne18x-on-pull-request-qt2kc reason: Running&#xA;PipelineRun go-component-wne18x-on-pull-request-qt2kc reason: Running&#xA;PipelineRun go-component-wne18x-on-pull-request-qt2kc reason: Running&#xA;PipelineRun go-component-wne18x-on-pull-request-qt2kc reason: Running&#xA;PipelineRun go-component-wne18x-on-pull-request-qt2kc reason: Running&#xA;PipelineRun go-component-wne18x-on-pull-request-qt2kc reason: Running&#xA;PipelineRun go-component-wne18x-on-pull-request-qt2kc reason: Running&#xA;PipelineRun go-component-wne18x-on-pull-request-qt2kc reason: Running&#xA;PipelineRun go-component-wne18x-on-pull-request-qt2kc reason: Running&#xA;PipelineRun go-component-wne18x-on-pull-request-qt2kc reason: Completed&#xA;PipelineRun python-component-2uipms-on-pull-request-fxs5c found for Component group-rojh/python-component-2uipms&#xA;PipelineRun python-component-2uipms-on-pull-request-fxs5c reason: Running&#xA;PipelineRun python-component-2uipms-on-pull-request-fxs5c reason: Running&#xA;PipelineRun python-component-2uipms-on-pull-request-fxs5c reason: Running&#xA;PipelineRun python-component-2uipms-on-pull-request-fxs5c reason: Completed&#xA;PipelineRun konflux-test-integration-clone-85iyin-on-pull-request-6bzrt found for Component group-rojh/konflux-test-integration-clone-85iyin&#xA;PipelineRun konflux-test-integration-clone-85iyin-on-pull-request-6bzrt reason: Completed&#xA;&lt; Exit [It] wait for the last components build to finish - /tmp/tmp.jToXo61xWY/repo/e2e-tests/tests/integration-service/group-snapshots-tests.go:515 @ 10/06/26 17:47:46.224 (10m40.031s)&#xA;&gt; Enter [AfterEach] [integration-service-suite Creation of group snapshots for monorepo and multiple repos] - /tmp/tmp.jToXo61xWY/repo/e2e-tests/tests/integration-service/group-snapshots-tests.go:50 @ 10/06/26 17:47:46.224&#xA;&lt; Exit [AfterEach] [integration-service-suite Creation of group snapshots for monorepo and multiple repos] - /tmp/tmp.jToXo61xWY/repo/e2e-tests/tests/integration-service/group-snapshots-tests.go:50 @ 10/06/26 17:47:46.224 (0s)&#xA;</system-err>
          </testcase>
          <testcase name="[It] [integration-service-suite Creation of group snapshots for monorepo and multiple repos] with status reporting of Integration tests in CheckRuns when both the init PaC PRs are merged wait for all component snapshots to be created with proper PR group annotations [integration-service, group-snapshot-creation]" classname="Red Hat App Studio E2E tests" status="passed" time="0.006031385">
              <system-err>&gt; Enter [It] wait for all component snapshots to be created with proper PR group annotations - /tmp/tmp.jToXo61xWY/repo/e2e-tests/tests/integration-service/group-snapshots-tests.go:525 @ 10/06/26 17:47:46.224&#xA;Component snapshot integ-app-wis4-20261006-171731-000 has PR group annotation: konflux-go-component-wne18x&#xA;Component snapshot integ-app-wis4-20261006-172420-000 is missing PR group annotation&#xA;Component snapshot integ-app-wis4-20261006-172426-000 has PR group annotation: konflux-python-component-2uipms&#xA;Component snapshot integ-app-wis4-20261006-173153-000 is missing PR group annotation&#xA;Component snapshot integ-app-wis4-20261006-173200-000 has PR group annotation: konflux-konflux-test-integration-clone-85iyin&#xA;Component snapshot integ-app-wis4-20261006-173706-000 is missing PR group annotation&#xA;Component snapshot integ-app-wis4-20261006-173706-000-1v has PR group annotation: pr-branch-2i0l6k&#xA;Component snapshot integ-app-wis4-20261006-173706-000-bi has PR group annotation: pr-branch-2i0l6k&#xA;Component snapshot integ-app-wis4-20261006-173710-000 has PR group annotation: pr-branch-2i0l6k&#xA;All component snapshots are ready with PR group annotations&#xA;&lt; Exit [It] wait for all component snapshots to be created with proper PR group annotations - /tmp/tmp.jToXo61xWY/repo/e2e-tests/tests/integration-service/group-snapshots-tests.go:525 @ 10/06/26 17:47:46.23 (6ms)&#xA;&gt; Enter [AfterEach] [integration-service-suite Creation of group snapshots for monorepo and multiple repos] - /tmp/tmp.jToXo61xWY/repo/e2e-tests/tests/integration-service/group-snapshots-tests.go:50 @ 10/06/26 17:47:46.23&#xA;&lt; Exit [AfterEach] [integration-service-suite Creation of group snapshots for monorepo and multiple repos] - /tmp/tmp.jToXo61xWY/repo/e2e-tests/tests/integration-service/group-snapshots-tests.go:50 @ 10/06/26 17:47:46.23 (0s)&#xA;</system-err>
          </testcase>
          <testcase name="[It] [integration-service-suite Creation of group snapshots for monorepo and multiple repos] with status reporting of Integration tests in CheckRuns when both the init PaC PRs are merged get all group snapshots and check if pr-group annotation contains all components [integration-service, group-snapshot-creation]" classname="Red Hat App Studio E2E tests" status="passed" time="0.008135882">
              <system-err>&gt; Enter [It] get all group snapshots and check if pr-group annotation contains all components - /tmp/tmp.jToXo61xWY/repo/e2e-tests/tests/integration-service/group-snapshots-tests.go:560 @ 10/06/26 17:47:46.23&#xA;Attempting to find group snapshots for application integ-app-wis4 in namespace group-rojh&#xA;Found 9 component snapshots:&#xA;PR Groups found: map[konflux-go-component-wne18x:1 konflux-konflux-test-integration-clone-85iyin:1 konflux-python-component-2uipms:1 pr-branch-2i0l6k:3]&#xA;Found 1 group snapshots!&#xA;  Group Snapshot 0: integ-app-wis4-20261006-174744-578 (type: group)&#xA;    Group Test Info: [{&#34;namespace&#34;:&#34;group-rojh&#34;,&#34;component&#34;:&#34;go-component-wne18x&#34;,&#34;buildPipelineRun&#34;:&#34;go-component-wne18x-on-pull-request-qt2kc&#34;,&#34;snapshot&#34;:&#34;integ-app-wis4-20261006-173706-000-1v&#34;,&#34;repoUrl&#34;:&#34;https://github.com/redhat-appstudio-qe/group-snapshot-multi-component&#34;,&#34;pullRequestNumber&#34;:&#34;25469&#34;,&#34;version&#34;:&#34;&#34;},{&#34;namespace&#34;:&#34;group-rojh&#34;,&#34;component&#34;:&#34;konflux-test-integration-clone-85iyin&#34;,&#34;buildPipelineRun&#34;:&#34;konflux-test-integration-clone-85iyin-on-pull-request-6bzrt&#34;,&#34;snapshot&#34;:&#34;integ-app-wis4-20261006-173710-000&#34;,&#34;repoUrl&#34;:&#34;https://github.com/redhat-appstudio-qe/konflux-test-integration-clone&#34;,&#34;pullRequestNumber&#34;:&#34;10917&#34;,&#34;version&#34;:&#34;&#34;},{&#34;namespace&#34;:&#34;group-rojh&#34;,&#34;component&#34;:&#34;python-component-2uipms&#34;,&#34;buildPipelineRun&#34;:&#34;python-component-2uipms-on-pull-request-fxs5c&#34;,&#34;snapshot&#34;:&#34;integ-app-wis4-20261006-173706-000-bi&#34;,&#34;repoUrl&#34;:&#34;https://github.com/redhat-appstudio-qe/group-snapshot-multi-component&#34;,&#34;pullRequestNumber&#34;:&#34;25469&#34;,&#34;version&#34;:&#34;&#34;}]&#xA;Validating group test info annotation: [{&#34;namespace&#34;:&#34;group-rojh&#34;,&#34;component&#34;:&#34;go-component-wne18x&#34;,&#34;buildPipelineRun&#34;:&#34;go-component-wne18x-on-pull-request-qt2kc&#34;,&#34;snapshot&#34;:&#34;integ-app-wis4-20261006-173706-000-1v&#34;,&#34;repoUrl&#34;:&#34;https://github.com/redhat-appstudio-qe/group-snapshot-multi-component&#34;,&#34;pullRequestNumber&#34;:&#34;25469&#34;,&#34;version&#34;:&#34;&#34;},{&#34;namespace&#34;:&#34;group-rojh&#34;,&#34;component&#34;:&#34;konflux-test-integration-clone-85iyin&#34;,&#34;buildPipelineRun&#34;:&#34;konflux-test-integration-clone-85iyin-on-pull-request-6bzrt&#34;,&#34;snapshot&#34;:&#34;integ-app-wis4-20261006-173710-000&#34;,&#34;repoUrl&#34;:&#34;https://github.com/redhat-appstudio-qe/konflux-test-integration-clone&#34;,&#34;pullRequestNumber&#34;:&#34;10917&#34;,&#34;version&#34;:&#34;&#34;},{&#34;namespace&#34;:&#34;group-rojh&#34;,&#34;component&#34;:&#34;python-component-2uipms&#34;,&#34;buildPipelineRun&#34;:&#34;python-component-2uipms-on-pull-request-fxs5c&#34;,&#34;snapshot&#34;:&#34;integ-app-wis4-20261006-173706-000-bi&#34;,&#34;repoUrl&#34;:&#34;https://github.com/redhat-appstudio-qe/group-snapshot-multi-component&#34;,&#34;pullRequestNumber&#34;:&#34;25469&#34;,&#34;version&#34;:&#34;&#34;}]&#xA;Group snapshot validation completed successfully&#xA;&lt; Exit [It] get all group snapshots and check if pr-group annotation contains all components - /tmp/tmp.jToXo61xWY/repo/e2e-tests/tests/integration-service/group-snapshots-tests.go:560 @ 10/06/26 17:47:46.238 (8ms)&#xA;&gt; Enter [AfterEach] [integration-service-suite Creation of group snapshots for monorepo and multiple repos] - /tmp/tmp.jToXo61xWY/repo/e2e-tests/tests/integration-service/group-snapshots-tests.go:50 @ 10/06/26 17:47:46.238&#xA;&lt; Exit [AfterEach] [integration-service-suite Creation of group snapshots for monorepo and multiple repos] - /tmp/tmp.jToXo61xWY/repo/e2e-tests/tests/integration-service/group-snapshots-tests.go:50 @ 10/06/26 17:47:46.238 (0s)&#xA;</system-err>
          </testcase>
          <testcase name="[It] [integration-service-suite Creation of group snapshots for monorepo and multiple repos] with status reporting of Integration tests in CheckRuns when both the init PaC PRs are merged make sure that group snapshot contains last build pipelinerun for each component [integration-service, group-snapshot-creation]" classname="Red Hat App Studio E2E tests" status="passed" time="0.101135429">
              <system-err>&gt; Enter [It] make sure that group snapshot contains last build pipelinerun for each component - /tmp/tmp.jToXo61xWY/repo/e2e-tests/tests/integration-service/group-snapshots-tests.go:639 @ 10/06/26 17:47:46.238&#xA;&lt; Exit [It] make sure that group snapshot contains last build pipelinerun for each component - /tmp/tmp.jToXo61xWY/repo/e2e-tests/tests/integration-service/group-snapshots-tests.go:639 @ 10/06/26 17:47:46.339 (101ms)&#xA;&gt; Enter [AfterEach] [integration-service-suite Creation of group snapshots for monorepo and multiple repos] - /tmp/tmp.jToXo61xWY/repo/e2e-tests/tests/integration-service/group-snapshots-tests.go:50 @ 10/06/26 17:47:46.339&#xA;&lt; Exit [AfterEach] [integration-service-suite Creation of group snapshots for monorepo and multiple repos] - /tmp/tmp.jToXo61xWY/repo/e2e-tests/tests/integration-service/group-snapshots-tests.go:50 @ 10/06/26 17:47:46.339 (0s)&#xA;</system-err>
          </testcase>
          <testcase name="[It] [integration-service-suite Creation of group snapshots for monorepo and multiple repos] with status reporting of Integration tests in CheckRuns when Older snapshot and integration pipelinerun should be cancelled once new snapshot is created make change to the multiple-repo to trigger a new cycle of testing [integration-service, group-snapshot-creation]" classname="Red Hat App Studio E2E tests" status="passed" time="0.815129515">
              <system-err>&gt; Enter [It] make change to the multiple-repo to trigger a new cycle of testing - /tmp/tmp.jToXo61xWY/repo/e2e-tests/tests/integration-service/group-snapshots-tests.go:652 @ 10/06/26 17:47:46.339&#xA;&lt; Exit [It] make change to the multiple-repo to trigger a new cycle of testing - /tmp/tmp.jToXo61xWY/repo/e2e-tests/tests/integration-service/group-snapshots-tests.go:652 @ 10/06/26 17:47:47.154 (815ms)&#xA;&gt; Enter [AfterEach] [integration-service-suite Creation of group snapshots for monorepo and multiple repos] - /tmp/tmp.jToXo61xWY/repo/e2e-tests/tests/integration-service/group-snapshots-tests.go:50 @ 10/06/26 17:47:47.154&#xA;&lt; Exit [AfterEach] [integration-service-suite Creation of group snapshots for monorepo and multiple repos] - /tmp/tmp.jToXo61xWY/repo/e2e-tests/tests/integration-service/group-snapshots-tests.go:50 @ 10/06/26 17:47:47.154 (0s)&#xA;</system-err>
          </testcase>
          <testcase name="[It] [integration-service-suite Creation of group snapshots for monorepo and multiple repos] with status reporting of Integration tests in CheckRuns when Older snapshot and integration pipelinerun should be cancelled once new snapshot is created wait for the components A and B build to finish [integration-service, group-snapshot-creation]" classname="Red Hat App Studio E2E tests" status="passed" time="460.342798452">
              <system-err>&gt; Enter [It] wait for the components A and B build to finish - /tmp/tmp.jToXo61xWY/repo/e2e-tests/tests/integration-service/group-snapshots-tests.go:658 @ 10/06/26 17:47:47.154&#xA;Waiting for build pipelineRun to be created for app group-rojh/integ-app-wis4, sha: 72ef3d294e9480d685ccdec751db6c7fe1f2b92a&#xA;PipelineRun has not been created yet for the Component group-rojh/go-component-wne18x&#xA;PipelineRun go-component-wne18x-on-pull-request-64684 found for Component group-rojh/go-component-wne18x&#xA;PipelineRun go-component-wne18x-on-pull-request-64684 reason: ResolvingTaskRef&#xA;PipelineRun go-component-wne18x-on-pull-request-64684 reason: Running&#xA;PipelineRun go-component-wne18x-on-pull-request-64684 reason: Running&#xA;PipelineRun go-component-wne18x-on-pull-request-64684 reason: Running&#xA;PipelineRun go-component-wne18x-on-pull-request-64684 reason: Running&#xA;PipelineRun go-component-wne18x-on-pull-request-64684 reason: Running&#xA;PipelineRun go-component-wne18x-on-pull-request-64684 reason: Running&#xA;PipelineRun go-component-wne18x-on-pull-request-64684 reason: Running&#xA;PipelineRun go-component-wne18x-on-pull-request-64684 reason: Running&#xA;PipelineRun go-component-wne18x-on-pull-request-64684 reason: Running&#xA;PipelineRun go-component-wne18x-on-pull-request-64684 reason: Running&#xA;PipelineRun go-component-wne18x-on-pull-request-64684 reason: Running&#xA;PipelineRun go-component-wne18x-on-pull-request-64684 reason: Running&#xA;PipelineRun go-component-wne18x-on-pull-request-64684 reason: Running&#xA;PipelineRun go-component-wne18x-on-pull-request-64684 reason: Running&#xA;PipelineRun go-component-wne18x-on-pull-request-64684 reason: Running&#xA;PipelineRun go-component-wne18x-on-pull-request-64684 reason: Running&#xA;PipelineRun go-component-wne18x-on-pull-request-64684 reason: Running&#xA;PipelineRun go-component-wne18x-on-pull-request-64684 reason: Running&#xA;PipelineRun go-component-wne18x-on-pull-request-64684 reason: Running&#xA;PipelineRun go-component-wne18x-on-pull-request-64684 reason: Running&#xA;PipelineRun go-component-wne18x-on-pull-request-64684 reason: Running&#xA;PipelineRun go-component-wne18x-on-pull-request-64684 reason: Completed&#xA;PipelineRun python-component-2uipms-on-pull-request-fzvtp found for Component group-rojh/python-component-2uipms&#xA;PipelineRun python-component-2uipms-on-pull-request-fzvtp reason: Completed&#xA;&lt; Exit [It] wait for the components A and B build to finish - /tmp/tmp.jToXo61xWY/repo/e2e-tests/tests/integration-service/group-snapshots-tests.go:658 @ 10/06/26 17:55:27.497 (7m40.343s)&#xA;&gt; Enter [AfterEach] [integration-service-suite Creation of group snapshots for monorepo and multiple repos] - /tmp/tmp.jToXo61xWY/repo/e2e-tests/tests/integration-service/group-snapshots-tests.go:50 @ 10/06/26 17:55:27.497&#xA;&lt; Exit [AfterEach] [integration-service-suite Creation of group snapshots for monorepo and multiple repos] - /tmp/tmp.jToXo61xWY/repo/e2e-tests/tests/integration-service/group-snapshots-tests.go:50 @ 10/06/26 17:55:27.497 (0s)&#xA;</system-err>
          </testcase>
          <testcase name="[It] [integration-service-suite Creation of group snapshots for monorepo and multiple repos] with status reporting of Integration tests in CheckRuns when Older snapshot and integration pipelinerun should be cancelled once new snapshot is created get all component snapshots for component A and check if older snapshot has been cancelled [integration-service, group-snapshot-creation]" classname="Red Hat App Studio E2E tests" status="passed" time="0.033122316">
              <system-err>&gt; Enter [It] get all component snapshots for component A and check if older snapshot has been cancelled - /tmp/tmp.jToXo61xWY/repo/e2e-tests/tests/integration-service/group-snapshots-tests.go:667 @ 10/06/26 17:55:27.497&#xA;&lt; Exit [It] get all component snapshots for component A and check if older snapshot has been cancelled - /tmp/tmp.jToXo61xWY/repo/e2e-tests/tests/integration-service/group-snapshots-tests.go:667 @ 10/06/26 17:55:27.53 (33ms)&#xA;&gt; Enter [AfterEach] [integration-service-suite Creation of group snapshots for monorepo and multiple repos] - /tmp/tmp.jToXo61xWY/repo/e2e-tests/tests/integration-service/group-snapshots-tests.go:50 @ 10/06/26 17:55:27.53&#xA;&lt; Exit [AfterEach] [integration-service-suite Creation of group snapshots for monorepo and multiple repos] - /tmp/tmp.jToXo61xWY/repo/e2e-tests/tests/integration-service/group-snapshots-tests.go:50 @ 10/06/26 17:55:27.53 (0s)&#xA;</system-err>
          </testcase>
          <testcase name="[It] [integration-service-suite Creation of group snapshots for monorepo and multiple repos] with status reporting of Integration tests in CheckRuns when Older snapshot and integration pipelinerun should be cancelled once new snapshot is created get all group snapshots and check if older group snapshot is cancelled [integration-service, group-snapshot-creation]" classname="Red Hat App Studio E2E tests" status="passed" time="0.15996743">
              <system-err>&gt; Enter [It] get all group snapshots and check if older group snapshot is cancelled - /tmp/tmp.jToXo61xWY/repo/e2e-tests/tests/integration-service/group-snapshots-tests.go:694 @ 10/06/26 17:55:27.53&#xA;&lt; Exit [It] get all group snapshots and check if older group snapshot is cancelled - /tmp/tmp.jToXo61xWY/repo/e2e-tests/tests/integration-service/group-snapshots-tests.go:694 @ 10/06/26 17:55:27.69 (160ms)&#xA;&gt; Enter [AfterEach] [integration-service-suite Creation of group snapshots for monorepo and multiple repos] - /tmp/tmp.jToXo61xWY/repo/e2e-tests/tests/integration-service/group-snapshots-tests.go:50 @ 10/06/26 17:55:27.69&#xA;&lt; Exit [AfterEach] [integration-service-suite Creation of group snapshots for monorepo and multiple repos] - /tmp/tmp.jToXo61xWY/repo/e2e-tests/tests/integration-service/group-snapshots-tests.go:50 @ 10/06/26 17:55:27.69 (0s)&#xA;</system-err>
          </testcase>
          <testcase name="[It] [integration-service-suite Creation of group snapshots for monorepo and multiple repos] with status reporting of Integration tests in CheckRuns when ResolutionRequest is deleted after pipeline completes verifies that ResolutionRequest is deleted after pipeline resolution [integration-service, group-snapshot-creation]" classname="Red Hat App Studio E2E tests" status="passed" time="0.202929757">
              <system-err>&gt; Enter [It] verifies that ResolutionRequest is deleted after pipeline resolution - /tmp/tmp.jToXo61xWY/repo/e2e-tests/tests/integration-service/group-snapshots-tests.go:724 @ 10/06/26 17:55:27.69&#xA;&lt; Exit [It] verifies that ResolutionRequest is deleted after pipeline resolution - /tmp/tmp.jToXo61xWY/repo/e2e-tests/tests/integration-service/group-snapshots-tests.go:724 @ 10/06/26 17:55:27.893 (203ms)&#xA;&gt; Enter [AfterEach] [integration-service-suite Creation of group snapshots for monorepo and multiple repos] - /tmp/tmp.jToXo61xWY/repo/e2e-tests/tests/integration-service/group-snapshots-tests.go:50 @ 10/06/26 17:55:27.893&#xA;&lt; Exit [AfterEach] [integration-service-suite Creation of group snapshots for monorepo and multiple repos] - /tmp/tmp.jToXo61xWY/repo/e2e-tests/tests/integration-service/group-snapshots-tests.go:50 @ 10/06/26 17:55:27.893 (0s)&#xA;</system-err>
          </testcase>
          <testcase name="[It] [integration-service-suite Creation of group snapshots for monorepo and multiple repos] with status reporting of Integration tests in CheckRuns when ResolutionRequest is deleted after pipeline completes verifies that no orphaned ResolutionRequests remain in namespace after test completion [integration-service, group-snapshot-creation]" classname="Red Hat App Studio E2E tests" status="passed" time="0.165701119">
              <system-err>&gt; Enter [It] verifies that no orphaned ResolutionRequests remain in namespace after test completion - /tmp/tmp.jToXo61xWY/repo/e2e-tests/tests/integration-service/group-snapshots-tests.go:744 @ 10/06/26 17:55:27.893&#xA;&lt; Exit [It] verifies that no orphaned ResolutionRequests remain in namespace after test completion - /tmp/tmp.jToXo61xWY/repo/e2e-tests/tests/integration-service/group-snapshots-tests.go:744 @ 10/06/26 17:55:28.059 (166ms)&#xA;&gt; Enter [AfterEach] [integration-service-suite Creation of group snapshots for monorepo and multiple repos] - /tmp/tmp.jToXo61xWY/repo/e2e-tests/tests/integration-service/group-snapshots-tests.go:50 @ 10/06/26 17:55:28.059&#xA;&lt; Exit [AfterEach] [integration-service-suite Creation of group snapshots for monorepo and multiple repos] - /tmp/tmp.jToXo61xWY/repo/e2e-tests/tests/integration-service/group-snapshots-tests.go:50 @ 10/06/26 17:55:28.059 (0s)&#xA;</system-err>
          </testcase>
          <testcase name="[It] [integration-service-suite Creation of group snapshots for monorepo and multiple repos] with status reporting of Integration tests in CheckRuns when IntegrationTestScenario reference to task as pipelinerun resolution trigger pipelinerun for invalid integrationTestScenario by annotating snapshot and verify failing to create integration pipelinerun [integration-service, group-snapshot-creation]" classname="Red Hat App Studio E2E tests" status="passed" time="72.077643208">
              <system-err>&gt; Enter [BeforeAll] when IntegrationTestScenario reference to task as pipelinerun resolution - /tmp/tmp.jToXo61xWY/repo/e2e-tests/tests/integration-service/group-snapshots-tests.go:779 @ 10/06/26 17:55:28.059&#xA;&lt; Exit [BeforeAll] when IntegrationTestScenario reference to task as pipelinerun resolution - /tmp/tmp.jToXo61xWY/repo/e2e-tests/tests/integration-service/group-snapshots-tests.go:779 @ 10/06/26 17:55:28.2 (141ms)&#xA;&gt; Enter [It] trigger pipelinerun for invalid integrationTestScenario by annotating snapshot and verify failing to create integration pipelinerun - /tmp/tmp.jToXo61xWY/repo/e2e-tests/tests/integration-service/group-snapshots-tests.go:784 @ 10/06/26 17:55:28.2&#xA;&lt; Exit [It] trigger pipelinerun for invalid integrationTestScenario by annotating snapshot and verify failing to create integration pipelinerun - /tmp/tmp.jToXo61xWY/repo/e2e-tests/tests/integration-service/group-snapshots-tests.go:784 @ 10/06/26 17:55:48.25 (20.05s)&#xA;&gt; Enter [AfterAll] with status reporting of Integration tests in CheckRuns - /tmp/tmp.jToXo61xWY/repo/e2e-tests/tests/integration-service/group-snapshots-tests.go:149 @ 10/06/26 17:55:48.25&#xA;&lt; Exit [AfterAll] with status reporting of Integration tests in CheckRuns - /tmp/tmp.jToXo61xWY/repo/e2e-tests/tests/integration-service/group-snapshots-tests.go:149 @ 10/06/26 17:56:40.136 (51.886s)&#xA;&gt; Enter [AfterEach] [integration-service-suite Creation of group snapshots for monorepo and multiple repos] - /tmp/tmp.jToXo61xWY/repo/e2e-tests/tests/integration-service/group-snapshots-tests.go:50 @ 10/06/26 17:56:40.137&#xA;&lt; Exit [AfterEach] [integration-service-suite Creation of group snapshots for monorepo and multiple repos] - /tmp/tmp.jToXo61xWY/repo/e2e-tests/tests/integration-service/group-snapshots-tests.go:50 @ 10/06/26 17:56:40.137 (0s)&#xA;</system-err>
          </testcase>
      </testsuite>
  </testsuites>